{"text_format":"1","workbook":"xlsx","n_sheets":6,"sheets":["Calendario","Dati","Archivio","Ritardatari","agenda","Servizio"],"not_rendered":{"charts":0,"images":32,"macros":1,"external_links":2,"defined_names":37,"comments":4,"pivot_tables":0},"unopened":[],"bounds":{"document_bytes":16777216,"sheet_cells":100000,"rows_first":2000,"rows_last":500,"rows_between":2000,"halvings":0,"cell_chars":16384,"cell_head_chars":4096},"cells_cut":0,"cells_raw":0,"read":"whole","date_system":"1900"}

{"sheet":"Calendario","index":0,"n_rows":37,"n_cols":14,"rows_kept":37,"cut":false,"hidden":true,"merged":[[35,4,36,4],[35,5,36,5],[35,8,36,8],[35,9,36,9],[31,4,32,4],[31,5,32,5],[31,8,32,8],[31,9,32,9],[33,4,34,4],[33,5,34,5],[33,8,34,8],[33,9,34,9],[27,4,28,4],[27,5,28,5],[27,8,28,8],[27,9,28,9],[29,4,30,4],[29,5,30,5],[29,8,30,8],[29,9,30,9],[23,4,24,4],[23,5,24,5],[23,8,24,8],[23,9,24,9],[25,4,26,4],[25,5,26,5],[25,8,26,8],[25,9,26,9],[19,4,20,4],[19,5,20,5],[19,8,20,8],[19,9,20,9],[21,4,22,4],[21,5,22,5],[21,8,22,8],[21,9,22,9],[15,4,16,4],[15,5,16,5],[15,8,16,8],[15,9,16,9],[17,4,18,4],[17,5,18,5],[17,8,18,8],[17,9,18,9],[11,4,12,4],[11,5,12,5],[11,8,12,8],[11,9,12,9],[13,4,14,4],[13,5,14,5],[13,8,14,8],[13,9,14,9],[7,4,8,4],[7,5,8,5],[7,8,8,8],[7,9,8,9],[9,4,10,4],[9,5,10,5],[9,8,10,8],[9,9,10,9],[1,1,1,13],[3,1,3,2],[3,4,3,10],[3,12,3,13],[5,4,6,4],[5,5,6,5],[5,8,6,8],[5,9,6,9]]}
[null,null,null,null,null,null,null,null,null,null,null,null,null,0]
[]
[]
[null,{"$f":"(TEXT(B6,\"mmmm\")) & CHAR(10) & (TEXT(B6,\"aaaa\"))","v":"settembre\n2021"},null,null,{"$f":"UPPER(TEXT(E6,\"mmmm aaaa\"))","v":"OTTOBRE 2021"},null,null,null,null,null,null,null,{"$f":"(TEXT(M6,\"mmmm\")) & CHAR(10) & (TEXT(M6,\"aaaa\"))","v":"novembre\n2021"}]
[]
[null,{"$f":"DATE(ANNO,MESE-1,1)","v":"2021-09-01"},{"$f":"+B6","v":"2021-09-01"},null,{"$f":"DATE(ANNO,MESE,1)","v":"2021-10-01"},{"$f":"+E6","v":"2021-10-01"},{"$f":"VLOOKUP(MONTH(E6)*100+DAY(E6),RICORRENZE,3,FALSE)","v":""},null,{"$f":"+E36+1","v":"2021-10-17"},{"$f":"+I6","v":"2021-10-17"},{"$f":"VLOOKUP(MONTH(I6)*100+DAY(I6),RICORRENZE,3,FALSE)","v":""},null,{"$f":"+N6","v":"2021-11-01"},{"$f":"DATE(ANNO,MESE+1,1)","v":"2021-11-01"}]
[null,{"$f":"+B6+1","v":"2021-09-02"},{"$f":"+B7","v":"2021-09-02"},null,null,null,{"$f":"VLOOKUP(MONTH(E6)*100+DAY(E6),SANTI,2,FALSE)","v":"S. TERESA DEL B.G."},null,null,null,{"$f":"VLOOKUP(MONTH(I6)*100+DAY(I6),SANTI,2,FALSE)","v":"S. IGNAZIO D'A. , S. RODOLFO"},null,{"$f":"+M6+1","v":"2021-11-02"},{"$f":"+N6+1","v":"2021-11-02"}]
[null,{"$f":"+B7+1","v":"2021-09-03"},"2021-09-03",null,{"$f":"+E6+1","v":"2021-10-02"},{"$f":"+E8","v":"2021-10-02"},{"$f":"VLOOKUP(MONTH(E8)*100+DAY(E8),RICORRENZE,3,FALSE)","v":"festa dei nonni"},null,{"$f":"+I6+1","v":"2021-10-18"},{"$f":"+I8","v":"2021-10-18"},{"$f":"VLOOKUP(MONTH(I8)*100+DAY(I8),RICORRENZE,3,FALSE)","v":""},null,{"$f":"+M7+1","v":"2021-11-03"},"2021-11-03"]
[null,"2021-09-04","2021-09-04",null,null,null,{"$f":"VLOOKUP(MONTH(E8)*100+DAY(E8),SANTI,2,FALSE)","v":"SS. ANGELI CUSTODI"},null,null,null,{"$f":"VLOOKUP(MONTH(I8)*100+DAY(I8),SANTI,2,FALSE)","v":"S. LUCA EVANG."},null,"2021-11-04","2021-11-04"]
[null,"2021-09-05","2021-09-05",null,{"$f":"+E8+1","v":"2021-10-03"},{"$f":"+E10","v":"2021-10-03"},{"$f":"VLOOKUP(MONTH(E10)*100+DAY(E10),RICORRENZE,3,FALSE)","v":""},null,{"$f":"+I8+1","v":"2021-10-19"},{"$f":"+I10","v":"2021-10-19"},{"$f":"VLOOKUP(MONTH(I10)*100+DAY(I10),RICORRENZE,3,FALSE)","v":""},null,"2021-11-05","2021-11-05"]
[null,"2021-09-06","2021-09-06",null,null,null,{"$f":"VLOOKUP(MONTH(E10)*100+DAY(E10),SANTI,2,FALSE)","v":"S. GERARDO AB."},null,null,null,{"$f":"VLOOKUP(MONTH(I10)*100+DAY(I10),SANTI,2,FALSE)","v":"S. ISACCO M. , S. LAURA"},null,"2021-11-06","2021-11-06"]
[null,"2021-09-07","2021-09-07",null,{"$f":"+E10+1","v":"2021-10-04"},{"$f":"+E12","v":"2021-10-04"},{"$f":"VLOOKUP(MONTH(E12)*100+DAY(E12),RICORRENZE,3,FALSE)","v":"patrono d'Italia"},null,{"$f":"+I10+1","v":"2021-10-20"},{"$f":"+I12","v":"2021-10-20"},{"$f":"VLOOKUP(MONTH(I12)*100+DAY(I12),RICORRENZE,3,FALSE)","v":""},null,"2021-11-07","2021-11-07"]
[null,"2021-09-08","2021-09-08",null,null,null,{"$f":"VLOOKUP(MONTH(E12)*100+DAY(E12),SANTI,2,FALSE)","v":"S. FRANCESCO D'ASSISI"},null,null,null,{"$f":"VLOOKUP(MONTH(I12)*100+DAY(I12),SANTI,2,FALSE)","v":"S. IRENE"},null,"2021-11-08","2021-11-08"]
[null,"2021-09-09","2021-09-09",null,{"$f":"+E12+1","v":"2021-10-05"},{"$f":"+E14","v":"2021-10-05"},{"$f":"VLOOKUP(MONTH(E14)*100+DAY(E14),RICORRENZE,3,FALSE)","v":""},null,{"$f":"+I12+1","v":"2021-10-21"},{"$f":"+I14","v":"2021-10-21"},{"$f":"VLOOKUP(MONTH(I14)*100+DAY(I14),RICORRENZE,3,FALSE)","v":""},null,"2021-11-09","2021-11-09"]
[null,"2021-09-10","2021-09-10",null,null,null,{"$f":"VLOOKUP(MONTH(E14)*100+DAY(E14),SANTI,2,FALSE)","v":"S. PLACIDO MARTIRE"},null,null,null,{"$f":"VLOOKUP(MONTH(I14)*100+DAY(I14),SANTI,2,FALSE)","v":"S. ORSOLA"},null,"2021-11-10","2021-11-10"]
{"$rows_left_out":23}
{"sheet":"Dati","index":1,"n_rows":394,"n_cols":11,"rows_kept":394,"cut":false,"hidden":true,"merged":[[1,4,2,4],[3,2,16,2],[17,2,27,2],[1,0,2,0],[1,1,2,1],[1,2,2,2],[1,3,2,3]]}
[]
["Indice","Festività / Santo","Ricorrenza personale\n(compilare solo le caselle gialle)","Giorno","Mese",2021]
[null,null,null,null,null,10]
[{"$f":"E4*100+D4","v":101},"MARIA MADRE DI DIO - Capodanno","Giorni Festivi",1,1,{"$f":"DATE(ANNO,E4,D4)","v":"2021-01-01"}]
[106,"EPIFANIA DI N.S.",null,6,1,"2021-01-06",null,null,null,null,"Ricorrenze personali"]
[425,"S. MARCO EVANGELISTA - ANNIV. LIBERAZIONE",null,25,4,"2021-04-25",null,null,null,null,"Compilare le caselle gialle per avere"]
[501,"SAN GIUSEPPE ARTIGIANO",null,1,5,"2021-05-01",null,null,null,null,"le proprie ricorrenze personali riportate"]
[602,"FESTA DELLA REPUBBLICA - S. MARCELLINO",null,2,6,"2021-06-02",null,null,null,null,"sul calendario nel giorno corretto."]
[815,"ASSUNZIONE MARIA VERGINE",null,15,8,"2021-08-15"]
[1101,"TUTTI I SANTI",null,1,11,"2021-11-01",null,null,null,null,"In giallo le caselle modificabili con i tuoi appunti"]
[1208,"IMMACOLATA CONCEZIONE",null,8,12,"2021-12-08",null,null,null,null,"In rosso le festività "]
[1225,"NATALE DEL SIGNORE",null,25,12,"2021-12-25",null,null,null,null,"In grigio le caselle calcolate"]
[1226,"S. STEFANO PROTOM.",null,26,12,"2021-12-26"]
[101,"Patrono",null,1,1,"2021-01-01",null,null,null,null,"L'area \"Dati\" serve per memorizzare eventi speciali (colonna C)"]
[101,"Varie 1",null,1,1,"2021-01-01",null,null,null,null,"che saranno riportati automaticamente nel calendario, sopra al santo del giorno."]
{"$rows_left_out":380}
{"sheet":"Archivio","index":2,"n_rows":222,"n_cols":60,"rows_kept":222,"cut":false,"hidden":false,"merged":[[0,8,0,17],[0,20,0,22],[0,24,0,26]]}
[{"$f":"MAX($A$3:$A$6049)","v":9994},{"$f":"IFERROR(VLOOKUP(A1,$A$3:$B$5049,2,0),\"\")","v":127},{"$f":"IFERROR(VLOOKUP($A$1,$A$3:$C$5049,3,0),\"\")","v":"2021-10-23"},null,null,null,null,null,"Archivio Lotto  ",null,null,null,null,null,null,null,null,null,"Dal",null,{"$f":"$C$3","v":"2020-05-30"},null,null,"al",{"$f":"$C$1","v":"2021-10-23"},null,null,null,null,null,null,null,null,null,null,38]
["Record","Pr","Data","Bari",null,null,null,null,"Cagliari",null,null,null,null,"Firenze",null,null,null,null,"Genova",null,null,null,null,"Milano",null,null,null,null,"Napoli",null,null,null,null,"Palermo",null,null,null,null,"Roma",null,null,null,null,"Torino",null,null,null,null,"Venezia",null,null,null,null,"Nazionale"]
[9775,47,"2020-05-30",60,36,84,30,73,41,42,31,55,70,66,79,32,77,55,54,83,39,65,43,21,53,19,90,63,41,2,58,85,3,52,45,10,14,40,32,27,36,15,13,66,49,45,55,81,2,12,77,88,54,82,79,33,55,45]
[9776,48,"2020-06-03",31,54,23,65,77,25,89,33,52,10,44,2,15,55,90,52,19,86,46,51,51,89,79,75,27,9,56,35,85,28,38,86,19,61,41,80,40,70,6,69,31,72,82,50,20,45,82,52,12,89,31,9,22,15,46]
[9777,49,"2020-06-04",66,16,84,79,42,12,89,70,50,65,10,14,28,58,27,74,68,77,64,31,85,64,15,67,28,33,80,12,11,20,42,24,79,45,48,52,77,39,1,56,66,20,62,64,26,31,30,66,68,88,25,10,89,39,18]
[9778,50,"2020-06-06",68,48,37,22,27,33,52,81,56,3,73,81,75,67,35,27,54,21,40,72,31,11,58,16,79,23,88,80,73,28,77,59,2,3,4,68,85,73,24,34,25,46,17,52,84,15,60,64,51,72,3,46,25,9,5]
[9779,51,"2020-06-09",43,81,72,33,69,50,68,89,13,28,80,6,24,46,14,52,66,1,71,27,62,20,13,15,66,3,75,47,72,31,81,52,47,38,77,1,45,79,89,31,87,49,38,68,28,70,7,74,54,26,20,5,74,82,70]
[9780,52,"2020-06-11",48,33,53,35,86,1,40,18,28,5,67,9,35,47,64,19,25,31,27,42,40,72,2,5,44,47,62,84,66,14,32,66,1,80,56,10,30,81,3,57,88,64,15,46,2,41,80,35,42,68,15,82,77,28,66]
[9781,53,"2020-06-13",47,29,83,23,35,52,59,47,90,58,39,27,69,57,66,56,60,84,13,15,61,9,63,14,20,71,22,31,34,38,48,77,14,71,61,68,70,10,39,86,20,53,90,69,66,84,28,5,13,56,57,7,52,84,75]
[9782,54,"2020-06-16",90,22,52,65,67,26,71,70,49,65,59,40,18,36,42,31,78,8,15,65,58,14,48,5,7,39,46,79,59,19,83,53,13,45,41,37,2,26,28,20,76,18,15,8,67,89,2,46,48,87,24,68,54,31,10]
[9783,55,"2020-06-18",33,9,46,78,65,37,90,11,58,16,77,49,86,19,73,29,83,53,45,35,19,15,82,41,88,62,65,60,8,66,48,7,74,32,27,44,27,52,31,13,69,37,60,15,81,45,23,90,80,41,5,30,61,78,55]
[9784,56,"2020-06-20",32,73,29,80,14,41,59,30,79,22,66,47,1,13,49,8,67,13,59,55,13,57,37,53,59,78,18,63,83,61,57,25,26,48,65,90,68,34,54,50,52,74,26,66,44,64,36,74,51,16,75,43,24,25,88]
[9785,57,"2020-06-23",16,20,55,66,51,65,15,88,51,86,42,38,48,90,14,60,24,9,65,5,20,88,79,73,27,43,9,75,23,2,46,10,38,49,42,70,27,22,40,12,25,28,15,11,66,78,31,47,65,55,42,78,10,65,69]
[9786,58,"2020-06-25",26,50,20,27,64,52,36,25,37,9,63,31,41,50,7,30,48,85,81,68,80,15,77,29,90,47,67,51,85,80,88,28,46,29,13,89,75,74,46,48,7,22,8,51,11,65,90,14,71,53,56,52,31,86,17]
[9787,59,"2020-06-27",2,41,33,40,88,33,49,72,78,86,85,2,54,35,12,23,19,20,49,40,9,32,82,4,1,43,47,49,45,3,18,45,79,2,65,21,14,35,9,64,87,59,67,65,81,1,20,55,66,51,47,90,35,48,81]
{"$rows_left_out":208}
{"sheet":"Ritardatari","index":3,"n_rows":4951,"n_cols":53,"rows_kept":4951,"cut":false,"hidden":false,"merged":[[25,9,29,9],[0,9,4,9],[5,9,9,9],[10,9,14,9],[15,9,19,9],[20,9,24,9],[30,9,34,9],[35,9,39,9],[40,9,44,9],[45,9,49,9],[50,9,54,9]]}
["Ruota e posiz","Numero","tot","Num ADD","N° IN Ritr",{"$f":"COUNTIF(C2:C1000,0)","v":2},null,1,82,"Bari"]
["GE2",12,0,49,{"$f":"IF(MOD(B2+D2,90),MOD(B2+D2,90),90)","v":61},null,null,2,73,null,null,null,null,null,null,null,null,null,null,null,null,null,null,null,null,null,null,null,null,null,null,null,null,null,null,null,null,null,null,null,null,null,null,null,null,null,null,null,null,null,null,null,"BA1"]
["PA3",90,0,9,9,null,null,3,44,null,null,null,null,null,null,null,null,null,null,null,null,null,null,null,null,null,null,null,null,null,null,null,null,null,null,null,null,null,null,null,null,null,null,null,null,null,null,null,null,null,null,null,"BA2"]
["BA2",null,1,18,18,null,null,4,34,null,null,null,null,null,null,null,null,null,null,null,null,null,null,null,null,null,null,null,null,null,null,null,null,null,null,null,null,null,null,null,null,null,null,null,null,null,null,null,null,null,null,null,"BA3"]
["BA2",null,1,46,46,null,null,5,26,null,null,null,null,null,null,null,null,null,null,null,null,null,null,null,null,null,null,null,null,null,null,null,null,null,null,null,null,null,null,null,null,null,null,null,null,null,null,null,null,null,null,null,"BA4"]
["BA4",null,1,50,50,null,null,1,85,"Cagliari","Ult. Aggior.",null,null,null,null,null,null,null,null,null,null,null,null,null,null,null,null,null,null,null,null,null,null,null,null,null,null,null,null,null,null,null,null,null,null,null,null,null,null,null,null,null,"BA5"]
["FI1",null,1,89,89,null,null,2,70,null,"2021-10-23T22:19:00",null,null,null,null,null,null,null,null,null,null,null,null,null,null,null,null,null,null,null,null,null,null,null,null,null,null,null,null,null,null,null,null,null,null,null,null,null,null,null,null,null,"CA1"]
["GE3",null,1,33,33,null,null,3,67,null,"2021-10-23T22:19:00",null,null,null,null,null,null,null,null,null,null,null,null,null,null,null,null,null,null,null,null,null,null,null,null,null,null,null,null,null,null,null,null,null,null,null,null,null,null,null,null,null,"CA2"]
["GE4",null,1,17,17,null,null,4,44,null,44492.929861111108,null,null,null,null,null,null,null,null,null,null,null,null,null,null,null,null,null,null,null,null,null,null,null,null,null,null,null,null,null,null,null,null,null,null,null,null,null,null,null,null,null,"CA3"]
["GE4",null,1,27,27,null,null,5,34,null,null,null,null,null,null,null,null,null,null,null,null,null,null,null,null,null,null,null,null,null,null,null,null,null,null,null,null,null,null,null,null,null,null,null,null,null,null,null,null,null,null,null,"CA4"]
["GE5",null,1,78,78,null,null,1,32,"Firenze",null,null,null,null,null,null,null,null,null,null,null,null,null,null,null,null,null,null,null,null,null,null,null,null,null,null,null,null,null,null,null,null,null,null,null,null,null,null,null,null,null,null,"CA5"]
["MI1",null,1,2,2,null,null,2,41,null,null,null,null,null,null,null,null,null,null,null,null,null,null,null,null,null,null,null,null,null,null,null,null,null,null,null,null,null,null,null,null,null,null,null,null,null,null,null,null,null,null,null,"FI1"]
["MI4",null,1,55,55,null,null,3,14,null,null,null,null,null,null,null,null,null,null,null,null,null,null,null,null,null,null,null,null,null,null,null,null,null,null,null,null,null,null,null,null,null,null,null,null,null,null,null,null,null,null,null,"FI2"]
["PA2",null,1,61,61,null,null,4,55,null,null,null,null,null,null,null,null,null,null,null,null,null,null,null,null,null,null,null,null,null,null,null,null,null,null,null,null,null,null,null,null,null,null,null,null,null,null,null,null,null,null,null,"FI3"]
["PA2",null,1,68,68,null,null,5,87,null,null,null,null,null,null,null,null,null,null,null,null,null,null,null,null,null,null,null,null,null,null,null,null,null,null,null,null,null,null,null,null,null,null,null,null,null,null,null,null,null,null,null,"FI4"]
{"$rows_left_out":4937}
{"sheet":"agenda","index":4,"n_rows":46,"n_cols":55,"rows_kept":46,"cut":false,"hidden":true,"merged":[]}
[]
[]
[null,null,null,null,null,null,null,null,null,{"$f":"SUM(J5:J13)","v":35},null,null,null,null,null,null,null,null,null,null,{"$f":"SUM(U5:U13)","v":-4}]
[null,null,null,null,null,"N° Record","Ruota","Giocata","N° Di Punt","€ tot Spesi","1Ma Data Estr.",null,"N°1","N°2","N°3","N°4","N°5","N°6","Ultima data Estr.",null,"Entrate","AP/CH",null,null,null,null,"Date Ricariche",null,{"$f":"SUM(AC5:AC11)","v":10}]
[null,null,null,null,1,9992,"Roma","Ambo",2,2,"2021-10-19",{"$f":"K5","v":"2021-10-19"},5,16,29,56,null,null,"2021-10-21",{"$f":"S5","v":"2021-10-21"},-2,"C",null,null,null,null,"2021-10-12",{"$f":"AA5","v":"2021-10-12"},10]
[null,null,null,null,2,9993,"Milano","Ambo",2,2,"2021-10-21",{"$f":"IF(K6=\"\",\"-\",K6)","v":"2021-10-21"},19,66,70,76,null,null,"2021-10-23",{"$f":"IF(S6=\"\",\"-\",S6)","v":"2021-10-23"},-2,"C",null,null,null,null,null,{"$f":"IF(AA6=\"\",\"-\",AA6)","v":"-"},null,null,null,null,null,null,null,null,null,null,null,null,null,null,null,null,null,null,null,null,null,null,null,null,"Bari","A","Ambata"]
[null,null,null,null,3,9994,"Milano","Ambo",3,3,"2021-10-23",{"$f":"IF(K7=\"\",\"-\",K7)","v":"2021-10-23"},20,26,37,79,null,null,"2021-10-28",{"$f":"IF(S7=\"\",\"-\",S7)","v":"2021-10-28"},null,"A",null,null,null,null,null,{"$f":"IF(AA7=\"\",\"-\",AA7)","v":"-"},null,null,null,null,null,null,null,null,null,null,null,null,null,null,null,null,null,null,null,null,null,null,null,null,"Cagliari","C","Ambo"]
[null,null,null,null,4,994,"Torino","Ambata",3,4,"2021-10-23",{"$f":"IF(K8=\"\",\"-\",K8)","v":"2021-10-23"},78,6,null,null,null,null,"2021-10-28",{"$f":"IF(S8=\"\",\"-\",S8)","v":"2021-10-28"},null,"T",null,null,null,null,null,"-",null,null,null,null,null,null,null,null,null,null,null,null,null,null,null,null,null,null,null,null,null,null,null,null,"Firenze","T","Terno"]
[null,null,null,null,5,9994,"Roma","Ambata",3,12,"2021-10-23","2021-10-23",70,73,9,null,null,null,"2021-10-28","2021-10-28",null,"T",null,null,null,null,null,"-",null,null,null,null,null,null,null,null,null,null,null,null,null,null,null,null,null,null,null,null,null,null,null,null,"Genova",null,"Quaterna"]
[null,null,null,null,6,9995,"Bari","Ambata",3,12,"2021-10-26","2021-10-26",61,9,null,null,null,null,"2021-10-30","2021-10-30",null,"T",null,null,null,null,null,"-",null,null,null,null,null,null,null,null,null,null,null,null,null,null,null,null,null,null,null,null,null,null,null,null,"Milano",null,"Cinquina"]
[null,null,null,null,7,null,null,null,null,null,null,"-",null,null,null,null,null,null,null,"-",null,null,null,null,null,null,null,"-",null,null,null,null,null,null,null,null,null,null,null,null,null,null,null,null,null,null,null,null,null,null,null,null,"Napoli"]
[null,null,null,null,8,null,null,null,null,null,null,"-",null,null,null,null,null,null,null,"-",null,null,null,null,null,null,null,null,null,null,null,null,null,null,null,null,null,null,null,null,null,null,null,null,null,null,null,null,null,null,null,null,"Palermo"]
[null,null,null,null,9,null,null,null,null,null,null,"-",null,null,null,null,null,null,null,"-",null,null,null,null,null,null,null,null,null,null,null,null,null,null,null,null,null,null,null,null,null,null,null,null,null,null,null,null,null,null,null,null,"Roma"]
[null,null,null,null,10,null,null,null,null,null,null,"-",null,null,null,null,null,null,null,"-",null,null,null,null,null,null,null,null,null,null,null,null,null,null,null,null,null,null,null,null,null,null,null,null,null,null,null,null,null,null,null,null,"Torino"]
[null,null,null,null,11,null,null,null,null,null,null,"-",null,null,null,null,null,null,null,"-",null,null,null,null,null,null,null,null,null,null,null,null,null,null,null,null,null,null,null,null,null,null,null,null,null,null,null,null,null,null,null,null,"Venezia"]
{"$rows_left_out":32}
{"sheet":"Servizio","index":5,"n_rows":46,"n_cols":40,"rows_kept":46,"cut":false,"hidden":true,"merged":[]}
[]
[]
[]
[null,null,null,null,null,null,null,{"$f":"#REF!","v":{"$error":"#REF!"}},null,"Ruota e posiz","Num ADD"]
[null,null,"Meno 40",{"$f":"D7-40+1","v":9954},{"$f":"IFERROR(VLOOKUP(D5,Archivio!A3:C4998,3),\"manca\")","v":"2021-07-22"},null,1,"Bari",null,"VE2",71,null,null,"AMBATA SU 3 NUMERI x 4 Volte"]
[null,null,"Meno 128",{"$f":"D7-128+1","v":9866},{"$f":"IFERROR(VLOOKUP(D6,Archivio!A3:C4999,3),\"manca\")","v":"2020-12-29"},null,2,"Cagliari",null,"PA5",12,null,1,"TOT N°","x 1 N°","Spesa","tot sp","x 11","Netto -6%","in %",null,null,null,null,null,null,null,null,null,null,null,null,null,null,null,null,"PROMEMORIA"]
[null,null,"Record N°",9993,{"$f":"IFERROR(VLOOKUP(D7,Archivio!A3:C5000,3),\"manca\")","v":"2021-10-21"},null,3,"Firenze",null,"MI5",88,null,1,3,1,{"$f":"N7*O7","v":3},{"$f":"P7","v":3},{"$f":"O7*11.22","v":11.22},{"$f":"R7-(R7*6%)-P7","v":7.5468000000000011},{"$f":"S7/Q7","v":2.5156000000000005},null,"1mo estr","MI","Data Punt.","GG","i 3 numeri",null,null,"punto","Punto x3","Esito","Netto",null,null,null,null,"N° Record A2","Ruota","Addendi","Ritard."]
[null,null,"Piu 128",{"$f":"D7+128-1","v":10120},{"$f":"IFERROR(VLOOKUP(D8,Archivio!A3:C5001,3),\"manca\")","v":"2021-10-23"},null,4,"Genova",null,"VE5",72,null,2,3,1.5,{"$f":"N8*O8","v":4.5},{"$f":"P8+Q7","v":7.5},{"$f":"O8*11.22","v":16.830000000000002},{"$f":"(R8-(R8*6%)-Q8)","v":8.3202000000000016},{"$f":"S8/Q8","v":1.1093600000000001},null,null,1,"2021-10-23",{"$f":"IF(X8=\"\",\"-\",X8)","v":"2021-10-23"},5,23,15,2,{"$f":"AC8*3","v":6},"p",null,null,null,null,null,9866,"Bari",4,2]
[null,null,"Piu 40",{"$f":"D7+40-1","v":10032},{"$f":"IFERROR(VLOOKUP(D9,Archivio!A3:C5002,3),\"manca\")","v":"2021-10-23"},null,5,"Milano",null,null,null,null,3,3,2,{"$f":"N9*O9","v":6},{"$f":"P9+Q8","v":13.5},22.44,{"$f":"(R9-(R9*6%)-Q9)","v":7.5936000000000021},0.56248888888888904,null,null,2,"2021-10-26",{"$f":"IF(X9=\"\",\"-\",X9)","v":"2021-10-26"},5,23,15,2.5,{"$f":"AC9*3","v":7.5}]
[null,null,"Rec. in A2",9848,{"$f":"IFERROR(VLOOKUP(D10,Archivio!A5:C5003,3),\"manca\")","v":"2020-11-17"},null,6,"Napoli",null,null,null,null,4,3,3,{"$f":"N10*O10","v":9},22.5,33.660000000000004,{"$f":"(R10-(R10*6%)-Q10)","v":9.1404000000000032},0.40624000000000016,null,9994,3,"2021-10-28","2021-10-28",5,23,15,null,0]
[null,null,"Rec.finale",{"$f":"D10+(128)-1","v":9975},{"$f":"IFERROR(VLOOKUP(D11,Archivio!A6:C5004,3),\"manca\")","v":"2021-09-09"},null,7,"Palermo",null,null,null,null,null,null,null,null,null,null,null,null,null,"Progr N° 3",4,"2021-10-30","2021-10-30",5,23,15,null,0]
[null,null,"Rec.in Script",{"$f":"D10-1+88","v":9935},{"$f":"IFERROR(VLOOKUP(D12,Archivio!A7:C5005,3),\"manca\")","v":"2021-06-08"},null,8,"Roma"]
[null,null,"Rec. Script",9935,{"$f":"IFERROR(VLOOKUP(D13,Archivio!A8:C5006,3),\"manca\")","v":"2021-06-08"},null,9,"Torino",null,null,null,null,2,"TOT N°","x 1 N°","Spesa","tot sp","x 11","Netto -6%","in %"]
[null,null,"Rec.finale",{"$f":"D15+128-1","v":9975},{"$f":"IFERROR(VLOOKUP(D14,Archivio!A9:C5007,3),\"manca\")","v":"2021-09-09"},null,10,"Venezia",null,null,null,null,1,3,1.5,{"$f":"N14*O14","v":4.5},{"$f":"N14*11.22","v":33.660000000000004},{"$f":"O14*11","v":16.5},{"$f":"R14-(R14*6%)-P14","v":11.01},{"$f":"S14/Q14","v":0.32709447415329762},null,"1mo estr","MI","Data Punt.","GG","i 3 numeri",null,null,"punto","Punto x3","Esito","Netto"]
[null,null,"Rec. In A2",{"$f":"D13-88+1","v":9848},{"$f":"IFERROR(VLOOKUP(D15,Archivio!A10:C5008,3),\"manca\")","v":"2020-11-17"},null,11,"Nazionale",null,null,null,null,2,3,2,{"$f":"N15*O15","v":6},{"$f":"N15*11.22","v":33.660000000000004},{"$f":"O15*11","v":22},{"$f":"(R15-(R15*6%)-Q15)","v":-12.980000000000004},{"$f":"S15/Q15","v":-0.38562091503267981},null,null,1,null,{"$f":"IF(X15=\"\",\"-\",X15)","v":"-"},null,null,null,2,{"$f":"AC15*3","v":6}]
{"$rows_left_out":31}