{"text_format":"1","workbook":"xlsx","n_sheets":6,"sheets":["Calendario","Dati","Archivio","Ritardatari","agenda","Servizio"],"not_rendered":{"charts":0,"images":32,"macros":1,"external_links":2,"defined_names":37,"comments":4,"pivot_tables":0},"unopened":[],"bounds":{"document_bytes":16777216,"sheet_cells":100000,"rows_first":2000,"rows_last":500,"rows_between":2000,"halvings":0,"cell_chars":16384,"cell_head_chars":4096},"cells_cut":0,"cells_raw":0,"read":"whole","date_system":"1900"}

{"sheet":"Calendario","index":0,"n_rows":37,"n_cols":14,"rows_kept":37,"cut":false,"hidden":true,"merged":[[35,4,36,4],[35,5,36,5],[35,8,36,8],[35,9,36,9],[31,4,32,4],[31,5,32,5],[31,8,32,8],[31,9,32,9],[33,4,34,4],[33,5,34,5],[33,8,34,8],[33,9,34,9],[27,4,28,4],[27,5,28,5],[27,8,28,8],[27,9,28,9],[29,4,30,4],[29,5,30,5],[29,8,30,8],[29,9,30,9],[23,4,24,4],[23,5,24,5],[23,8,24,8],[23,9,24,9],[25,4,26,4],[25,5,26,5],[25,8,26,8],[25,9,26,9],[19,4,20,4],[19,5,20,5],[19,8,20,8],[19,9,20,9],[21,4,22,4],[21,5,22,5],[21,8,22,8],[21,9,22,9],[15,4,16,4],[15,5,16,5],[15,8,16,8],[15,9,16,9],[17,4,18,4],[17,5,18,5],[17,8,18,8],[17,9,18,9],[11,4,12,4],[11,5,12,5],[11,8,12,8],[11,9,12,9],[13,4,14,4],[13,5,14,5],[13,8,14,8],[13,9,14,9],[7,4,8,4],[7,5,8,5],[7,8,8,8],[7,9,8,9],[9,4,10,4],[9,5,10,5],[9,8,10,8],[9,9,10,9],[1,1,1,13],[3,1,3,2],[3,4,3,10],[3,12,3,13],[5,4,6,4],[5,5,6,5],[5,8,6,8],[5,9,6,9]]}
[null,null,null,null,null,null,null,null,null,null,null,null,null,0]
[]
[]
[null,{"$f":"(TEXT(B6,\"mmmm\")) & CHAR(10) & (TEXT(B6,\"aaaa\"))","v":"settembre\n2021"},null,null,{"$f":"UPPER(TEXT(E6,\"mmmm aaaa\"))","v":"OTTOBRE 2021"},null,null,null,null,null,null,null,{"$f":"(TEXT(M6,\"mmmm\")) & CHAR(10) & (TEXT(M6,\"aaaa\"))","v":"novembre\n2021"}]
[]
[null,{"$f":"DATE(ANNO,MESE-1,1)","v":"2021-09-01"},{"$f":"+B6","v":"2021-09-01"},null,{"$f":"DATE(ANNO,MESE,1)","v":"2021-10-01"},{"$f":"+E6","v":"2021-10-01"},{"$f":"VLOOKUP(MONTH(E6)*100+DAY(E6),RICORRENZE,3,FALSE)","v":""},null,{"$f":"+E36+1","v":"2021-10-17"},{"$f":"+I6","v":"2021-10-17"},{"$f":"VLOOKUP(MONTH(I6)*100+DAY(I6),RICORRENZE,3,FALSE)","v":""},null,{"$f":"+N6","v":"2021-11-01"},{"$f":"DATE(ANNO,MESE+1,1)","v":"2021-11-01"}]
[null,{"$f":"+B6+1","v":"2021-09-02"},{"$f":"+B7","v":"2021-09-02"},null,null,null,{"$f":"VLOOKUP(MONTH(E6)*100+DAY(E6),SANTI,2,FALSE)","v":"S. TERESA DEL B.G."},null,null,null,{"$f":"VLOOKUP(MONTH(I6)*100+DAY(I6),SANTI,2,FALSE)","v":"S. IGNAZIO D'A. , S. RODOLFO"},null,{"$f":"+M6+1","v":"2021-11-02"},{"$f":"+N6+1","v":"2021-11-02"}]
[null,{"$f":"+B7+1","v":"2021-09-03"},"2021-09-03",null,{"$f":"+E6+1","v":"2021-10-02"},{"$f":"+E8","v":"2021-10-02"},{"$f":"VLOOKUP(MONTH(E8)*100+DAY(E8),RICORRENZE,3,FALSE)","v":"festa dei nonni"},null,{"$f":"+I6+1","v":"2021-10-18"},{"$f":"+I8","v":"2021-10-18"},{"$f":"VLOOKUP(MONTH(I8)*100+DAY(I8),RICORRENZE,3,FALSE)","v":""},null,{"$f":"+M7+1","v":"2021-11-03"},"2021-11-03"]
[null,"2021-09-04","2021-09-04",null,null,null,{"$f":"VLOOKUP(MONTH(E8)*100+DAY(E8),SANTI,2,FALSE)","v":"SS. ANGELI CUSTODI"},null,null,null,{"$f":"VLOOKUP(MONTH(I8)*100+DAY(I8),SANTI,2,FALSE)","v":"S. LUCA EVANG."},null,"2021-11-04","2021-11-04"]
[null,"2021-09-05","2021-09-05",null,{"$f":"+E8+1","v":"2021-10-03"},{"$f":"+E10","v":"2021-10-03"},{"$f":"VLOOKUP(MONTH(E10)*100+DAY(E10),RICORRENZE,3,FALSE)","v":""},null,{"$f":"+I8+1","v":"2021-10-19"},{"$f":"+I10","v":"2021-10-19"},{"$f":"VLOOKUP(MONTH(I10)*100+DAY(I10),RICORRENZE,3,FALSE)","v":""},null,"2021-11-05","2021-11-05"]
[null,"2021-09-06","2021-09-06",null,null,null,{"$f":"VLOOKUP(MONTH(E10)*100+DAY(E10),SANTI,2,FALSE)","v":"S. GERARDO AB."},null,null,null,{"$f":"VLOOKUP(MONTH(I10)*100+DAY(I10),SANTI,2,FALSE)","v":"S. ISACCO M. , S. LAURA"},null,"2021-11-06","2021-11-06"]
[null,"2021-09-07","2021-09-07",null,{"$f":"+E10+1","v":"2021-10-04"},{"$f":"+E12","v":"2021-10-04"},{"$f":"VLOOKUP(MONTH(E12)*100+DAY(E12),RICORRENZE,3,FALSE)","v":"patrono d'Italia"},null,{"$f":"+I10+1","v":"2021-10-20"},{"$f":"+I12","v":"2021-10-20"},{"$f":"VLOOKUP(MONTH(I12)*100+DAY(I12),RICORRENZE,3,FALSE)","v":""},null,"2021-11-07","2021-11-07"]
[null,"2021-09-08","2021-09-08",null,null,null,{"$f":"VLOOKUP(MONTH(E12)*100+DAY(E12),SANTI,2,FALSE)","v":"S. FRANCESCO D'ASSISI"},null,null,null,{"$f":"VLOOKUP(MONTH(I12)*100+DAY(I12),SANTI,2,FALSE)","v":"S. IRENE"},null,"2021-11-08","2021-11-08"]
[null,"2021-09-09","2021-09-09",null,{"$f":"+E12+1","v":"2021-10-05"},{"$f":"+E14","v":"2021-10-05"},{"$f":"VLOOKUP(MONTH(E14)*100+DAY(E14),RICORRENZE,3,FALSE)","v":""},null,{"$f":"+I12+1","v":"2021-10-21"},{"$f":"+I14","v":"2021-10-21"},{"$f":"VLOOKUP(MONTH(I14)*100+DAY(I14),RICORRENZE,3,FALSE)","v":""},null,"2021-11-09","2021-11-09"]
[null,"2021-09-10","2021-09-10",null,null,null,{"$f":"VLOOKUP(MONTH(E14)*100+DAY(E14),SANTI,2,FALSE)","v":"S. PLACIDO MARTIRE"},null,null,null,{"$f":"VLOOKUP(MONTH(I14)*100+DAY(I14),SANTI,2,FALSE)","v":"S. ORSOLA"},null,"2021-11-10","2021-11-10"]
[null,"2021-09-11","2021-09-11",null,{"$f":"+E14+1","v":"2021-10-06"},{"$f":"+E16","v":"2021-10-06"},{"$f":"VLOOKUP(MONTH(E16)*100+DAY(E16),RICORRENZE,3,FALSE)","v":""},null,{"$f":"+I14+1","v":"2021-10-22"},{"$f":"+I16","v":"2021-10-22"},{"$f":"VLOOKUP(MONTH(I16)*100+DAY(I16),RICORRENZE,3,FALSE)","v":""},null,"2021-11-11","2021-11-11"]
[null,"2021-09-12","2021-09-12",null,null,null,{"$f":"VLOOKUP(MONTH(E16)*100+DAY(E16),SANTI,2,FALSE)","v":"S. BRUNO AB."},null,null,null,{"$f":"VLOOKUP(MONTH(I16)*100+DAY(I16),SANTI,2,FALSE)","v":"B.GIOVANNI PAOLO II (Papa)"},null,"2021-11-12","2021-11-12"]
[null,"2021-09-13","2021-09-13",null,{"$f":"+E16+1","v":"2021-10-07"},{"$f":"+E18","v":"2021-10-07"},{"$f":"VLOOKUP(MONTH(E18)*100+DAY(E18),RICORRENZE,3,FALSE)","v":""},null,{"$f":"+I16+1","v":"2021-10-23"},{"$f":"+I18","v":"2021-10-23"},{"$f":"VLOOKUP(MONTH(I18)*100+DAY(I18),RICORRENZE,3,FALSE)","v":""},null,"2021-11-13","2021-11-13"]
[null,"2021-09-14","2021-09-14",null,null,null,{"$f":"VLOOKUP(MONTH(E18)*100+DAY(E18),SANTI,2,FALSE)","v":"N.S. DEL ROSARIO"},null,null,null,{"$f":"VLOOKUP(MONTH(I18)*100+DAY(I18),SANTI,2,FALSE)","v":"S. GIOVANNI DA C."},null,"2021-11-14","2021-11-14"]
[null,"2021-09-15","2021-09-15",null,{"$f":"+E18+1","v":"2021-10-08"},{"$f":"+E20","v":"2021-10-08"},{"$f":"VLOOKUP(MONTH(E20)*100+DAY(E20),RICORRENZE,3,FALSE)","v":""},null,{"$f":"+I18+1","v":"2021-10-24"},{"$f":"+I20","v":"2021-10-24"},{"$f":"VLOOKUP(MONTH(I20)*100+DAY(I20),RICORRENZE,3,FALSE)","v":""},null,"2021-11-15","2021-11-15"]
[null,"2021-09-16","2021-09-16",null,null,null,{"$f":"VLOOKUP(MONTH(E20)*100+DAY(E20),SANTI,2,FALSE)","v":"S. PELAGIA, S. REPARATA"},null,null,null,{"$f":"VLOOKUP(MONTH(I20)*100+DAY(I20),SANTI,2,FALSE)","v":"S. ANTONIO M.C."},null,"2021-11-16","2021-11-16"]
[null,"2021-09-17","2021-09-17",null,{"$f":"+E20+1","v":"2021-10-09"},{"$f":"+E22","v":"2021-10-09"},{"$f":"VLOOKUP(MONTH(E22)*100+DAY(E22),RICORRENZE,3,FALSE)","v":""},null,{"$f":"+I20+1","v":"2021-10-25"},{"$f":"+I22","v":"2021-10-25"},{"$f":"VLOOKUP(MONTH(I22)*100+DAY(I22),RICORRENZE,3,FALSE)","v":""},null,"2021-11-17","2021-11-17"]
[null,"2021-09-18","2021-09-18",null,null,null,{"$f":"VLOOKUP(MONTH(E22)*100+DAY(E22),SANTI,2,FALSE)","v":"S. DIONIGI , S. FERRUCCIO"},null,null,null,{"$f":"VLOOKUP(MONTH(I22)*100+DAY(I22),SANTI,2,FALSE)","v":"S. CRISPINO, S. DARIA"},null,"2021-11-18","2021-11-18"]
[null,"2021-09-19","2021-09-19",null,{"$f":"+E22+1","v":"2021-10-10"},{"$f":"+E24","v":"2021-10-10"},{"$f":"VLOOKUP(MONTH(E24)*100+DAY(E24),RICORRENZE,3,FALSE)","v":""},null,{"$f":"+I22+1","v":"2021-10-26"},{"$f":"+I24","v":"2021-10-26"},{"$f":"VLOOKUP(MONTH(I24)*100+DAY(I24),RICORRENZE,3,FALSE)","v":""},null,{"$f":"+M23+1","v":"2021-11-19"},"2021-11-19"]
[null,"2021-09-20","2021-09-20",null,null,null,{"$f":"VLOOKUP(MONTH(E24)*100+DAY(E24),SANTI,2,FALSE)","v":"S. DANIELE M."},null,null,null,{"$f":"VLOOKUP(MONTH(I24)*100+DAY(I24),SANTI,2,FALSE)","v":"S. EVARISTO PAPA"},null,"2021-11-20","2021-11-20"]
[null,"2021-09-21","2021-09-21",null,{"$f":"+E24+1","v":"2021-10-11"},{"$f":"+E26","v":"2021-10-11"},{"$f":"VLOOKUP(MONTH(E26)*100+DAY(E26),RICORRENZE,3,FALSE)","v":""},null,{"$f":"+I24+1","v":"2021-10-27"},{"$f":"+I26","v":"2021-10-27"},{"$f":"VLOOKUP(MONTH(I26)*100+DAY(I26),RICORRENZE,3,FALSE)","v":""},null,"2021-11-21","2021-11-21"]
[null,"2021-09-22","2021-09-22",null,null,null,{"$f":"VLOOKUP(MONTH(E26)*100+DAY(E26),SANTI,2,FALSE)","v":"S. FIRMINO VESCOVO"},null,null,null,{"$f":"VLOOKUP(MONTH(I26)*100+DAY(I26),SANTI,2,FALSE)","v":"S. FIORENZO VESCOVO"},null,"2021-11-22","2021-11-22"]
[null,"2021-09-23","2021-09-23",null,{"$f":"+E26+1","v":"2021-10-12"},{"$f":"+E28","v":"2021-10-12"},{"$f":"VLOOKUP(MONTH(E28)*100+DAY(E28),RICORRENZE,3,FALSE)","v":""},null,{"$f":"+I26+1","v":"2021-10-28"},{"$f":"+I28","v":"2021-10-28"},{"$f":"VLOOKUP(MONTH(I28)*100+DAY(I28),RICORRENZE,3,FALSE)","v":""},null,"2021-11-23","2021-11-23"]
[null,"2021-09-24","2021-09-24",null,null,null,{"$f":"VLOOKUP(MONTH(E28)*100+DAY(E28),SANTI,2,FALSE)","v":"S. SERAFINO CAPP."},null,null,null,{"$f":"VLOOKUP(MONTH(I28)*100+DAY(I28),SANTI,2,FALSE)","v":"S. SIMONE"},null,"2021-11-24","2021-11-24"]
[null,"2021-09-25","2021-09-25",null,{"$f":"+E28+1","v":"2021-10-13"},{"$f":"+E30","v":"2021-10-13"},{"$f":"VLOOKUP(MONTH(E30)*100+DAY(E30),RICORRENZE,3,FALSE)","v":""},null,{"$f":"+I28+1","v":"2021-10-29"},{"$f":"+I30","v":"2021-10-29"},{"$f":"VLOOKUP(MONTH(I30)*100+DAY(I30),RICORRENZE,3,FALSE)","v":""},null,"2021-11-25","2021-11-25"]
[null,"2021-09-26","2021-09-26",null,null,null,{"$f":"VLOOKUP(MONTH(E30)*100+DAY(E30),SANTI,2,FALSE)","v":"S. EDOARDO RE"},null,null,null,{"$f":"VLOOKUP(MONTH(I30)*100+DAY(I30),SANTI,2,FALSE)","v":"S. ERMELINDA, S. MASSIMILIANO"},null,"2021-11-26","2021-11-26"]
[null,"2021-09-27","2021-09-27",null,{"$f":"+E30+1","v":"2021-10-14"},{"$f":"+E32","v":"2021-10-14"},{"$f":"VLOOKUP(MONTH(E32)*100+DAY(E32),RICORRENZE,3,FALSE)","v":""},null,{"$f":"+I30+1","v":"2021-10-30"},{"$f":"+I32","v":"2021-10-30"},{"$f":"VLOOKUP(MONTH(I32)*100+DAY(I32),RICORRENZE,3,FALSE)","v":""},null,"2021-11-27","2021-11-27"]
[null,{"$f":"+B32+1","v":"2021-09-28"},"2021-09-28",null,null,null,{"$f":"VLOOKUP(MONTH(E32)*100+DAY(E32),SANTI,2,FALSE)","v":"S. CALLISTO I PAPA"},null,null,null,{"$f":"VLOOKUP(MONTH(I32)*100+DAY(I32),SANTI,2,FALSE)","v":"S. GERMANO VESCOVO"},null,"2021-11-28","2021-11-28"]
[null,"2021-09-29","2021-09-29",null,{"$f":"+E32+1","v":"2021-10-15"},{"$f":"+E34","v":"2021-10-15"},{"$f":"VLOOKUP(MONTH(E34)*100+DAY(E34),RICORRENZE,3,FALSE)","v":""},null,{"$f":"+I32+1","v":"2021-10-31"},{"$f":"+I34","v":"2021-10-31"},{"$f":"VLOOKUP(MONTH(I34)*100+DAY(I34),RICORRENZE,3,FALSE)","v":""},null,"2021-11-29","2021-11-29"]
[null,{"$f":"+B34+1","v":"2021-09-30"},"2021-09-30",null,null,null,{"$f":"VLOOKUP(MONTH(E34)*100+DAY(E34),SANTI,2,FALSE)","v":"S. TERESA D'AVILA"},null,null,null,{"$f":"VLOOKUP(MONTH(I34)*100+DAY(I34),SANTI,2,FALSE)","v":"S. LUCILLA, S. QUINTINO"},null,"2021-11-30","2021-11-30"]
[null,"2021-10-01","2021-10-01",null,{"$f":"+E34+1","v":"2021-10-16"},{"$f":"+E36","v":"2021-10-16"},{"$f":"VLOOKUP(MONTH(E36)*100+DAY(E36),RICORRENZE,3,FALSE)","v":""},null,null,null,null,null,"2021-12-01","2021-12-01"]
[null,null,null,null,null,null,{"$f":"VLOOKUP(MONTH(E36)*100+DAY(E36),SANTI,2,FALSE)","v":"S. EDVIGE, S. MARGHERITA A., S. GALLO"}]

{"sheet":"Dati","index":1,"n_rows":394,"n_cols":11,"rows_kept":394,"cut":false,"hidden":true,"merged":[[1,4,2,4],[3,2,16,2],[17,2,27,2],[1,0,2,0],[1,1,2,1],[1,2,2,2],[1,3,2,3]]}
[]
["Indice","Festività / Santo","Ricorrenza personale\n(compilare solo le caselle gialle)","Giorno","Mese",2021]
[null,null,null,null,null,10]
[{"$f":"E4*100+D4","v":101},"MARIA MADRE DI DIO - Capodanno","Giorni Festivi",1,1,{"$f":"DATE(ANNO,E4,D4)","v":"2021-01-01"}]
[106,"EPIFANIA DI N.S.",null,6,1,"2021-01-06",null,null,null,null,"Ricorrenze personali"]
[425,"S. MARCO EVANGELISTA - ANNIV. LIBERAZIONE",null,25,4,"2021-04-25",null,null,null,null,"Compilare le caselle gialle per avere"]
[501,"SAN GIUSEPPE ARTIGIANO",null,1,5,"2021-05-01",null,null,null,null,"le proprie ricorrenze personali riportate"]
[602,"FESTA DELLA REPUBBLICA - S. MARCELLINO",null,2,6,"2021-06-02",null,null,null,null,"sul calendario nel giorno corretto."]
[815,"ASSUNZIONE MARIA VERGINE",null,15,8,"2021-08-15"]
[1101,"TUTTI I SANTI",null,1,11,"2021-11-01",null,null,null,null,"In giallo le caselle modificabili con i tuoi appunti"]
[1208,"IMMACOLATA CONCEZIONE",null,8,12,"2021-12-08",null,null,null,null,"In rosso le festività "]
[1225,"NATALE DEL SIGNORE",null,25,12,"2021-12-25",null,null,null,null,"In grigio le caselle calcolate"]
[1226,"S. STEFANO PROTOM.",null,26,12,"2021-12-26"]
[101,"Patrono",null,1,1,"2021-01-01",null,null,null,null,"L'area \"Dati\" serve per memorizzare eventi speciali (colonna C)"]
[101,"Varie 1",null,1,1,"2021-01-01",null,null,null,null,"che saranno riportati automaticamente nel calendario, sopra al santo del giorno."]
[404,"SS PASQUA",null,{"$f":"DAY(F16)","v":4},{"$f":"MONTH(F16)","v":4},{"$f":"FLOOR(DATE(ANNO,5,DAY(MINUTE(ANNO/38)/2+56)),7)-34","v":"2021-04-04"},null,null,null,null,"(esempio: date di compleanno, onomastici, anniversari, ecc)"]
[405,"LUNEDI' DELL'ANGELO",null,5,4,{"$f":"+Pasqua+1","v":"2021-04-05"}]
[217,"MERCOLEDI' DELLE CENERI","Calendario Cristiano",17,2,{"$f":"+Pasqua-46","v":"2021-02-17"},null,null,null,null,"E' possibile scegliere un mese qualunque tra il 2009 e il 2030"]
[221,"I^ di QUARESIMA",null,21,2,{"$f":"+Pasqua-42","v":"2021-02-21"}]
[228,"II^ di QUARESIMA",null,28,2,{"$f":"+Pasqua-35","v":"2021-02-28"}]
[307,"III^ di QUARESIMA",null,7,3,{"$f":"+Pasqua-28","v":"2021-03-07"}]
[314,"IV^ di QUARESIMA",null,14,3,{"$f":"+Pasqua-21","v":"2021-03-14"}]
[321,"DOMENICA DI PASSIONE",null,21,3,{"$f":"+Pasqua-14","v":"2021-03-21"}]
[328,"DOMENICA DELLE PALME",null,28,3,{"$f":"+Pasqua-7","v":"2021-03-28"}]
[516,"ASCENSIONE",null,16,5,{"$f":"+Pasqua+42","v":"2021-05-16"}]
[523,"PENTECOSTE",null,23,5,{"$f":"+Pasqua+49","v":"2021-05-23"}]
[530,"SS TRINITA'",null,30,5,{"$f":"+Pasqua+56","v":"2021-05-30"}]
[606,"CORPUS DOMINI",null,6,6,{"$f":"+Pasqua+63","v":"2021-06-06"}]
[101,"MARIA MADRE DI DIO","",1,1]
[102,"S. BASILIO VESCOVO",null,2,1]
[103,"S. GENOVEFFA","",3,1]
[104,"S. ERMETE","",4,1]
[105,"S. AMELIA","",5,1]
[106,"EPIFANIA DI N.S.","",6,1]
[107,"S. LUCIANO, S. RAIMONDO","",7,1]
[108,"S. MASSIMO , S. SEVERINO","",8,1]
[109,"S. GIULIANO MARTIRE","",9,1]
[110,"S. ALDO EREMITA","",10,1]
[111,"S. IGINO PAPA","",11,1]
[112,"S. MODESTO M.","",12,1]
[113,"S. ILARIO","",13,1]
[114,"S. FELICE M. , S. BIANCA","",14,1]
[115,"S. MAURO ABATE","",15,1]
[116,"S. MARCELLO PAPA","",16,1]
[117,"S. ANTONIO ABATE","",17,1]
[118,"S. LIBERATA","",18,1]
[119,"S. MARIO MARTIRE","",19,1]
[120,"S. SEBASTIANO","",20,1]
[121,"S. AGNESE","",21,1]
[122,"S. VINCENZO MARTIRE","",22,1]
[123,"S. EMERENZIANA","",23,1]
[124,"S. FRANCESCO DI SALES","",24,1]
[125,"CONVERSIONE DI S. PAOLO","",25,1]
[126,"SS. TITO E TIMOTEO , S. PAOLA","",26,1]
[127,"S. ANGELA MERICI","",27,1]
[128,"S. TOMMASO D'AQ., S. VALERIO","",28,1]
[129,"S. COSTANZO , S. CESARIO","",29,1]
[130,"S. MARTINA, S. SAVINA","",30,1]
[131,"S. GIOVANNI BOSCO","",31,1]
[201,"S. VERDIANA","",1,2]
[202,"PRES. DEL SIGNORE","",2,2]
[203,"S. BIAGIO, S. OSCAR, S. CINZIA","",3,2]
[204,"S. GILBERTO","",4,2]
[205,"S. AGATA","",5,2]
[206,"S. PAOLO MIKI","",6,2]
[207,"S. TEODORO MARTIRE","",7,2]
[208,"S. GIROLAMO EM.","",8,2]
[{"$f":"E68*100+D68","v":209},"S. APOLLONIA","",9,2]
[210,"S. ARNALDO, S. SCOLASTICA","",10,2]
[211,"S. DANTE , B.V. DI LOURDES","",11,2]
[212,"S. EULALIA","",12,2]
[213,"S. MAURA","",13,2]
[214,"S. VALENTINO MARTIRE","",14,2]
[215,"S. FAUSTINO","Patrono BS",15,2]
[216,"S. GIULIANA VERGINE","",16,2]
[217,"S. DONATO MARTIRE","",17,2]
[218,"S. SIMONE VESCOVO","",18,2]
[219,"S. MANSUETO , S. TULLIO","",19,2]
[220,"S. SILVANO, S. ELEUTERIO V.","",20,2]
[221,"S. PIER DAMIANI, S. ELEONORA","",21,2]
[222,"S. MARGHERITA","",22,2]
[223,"S. RENZO","",23,2]
[224,"S. EDILBERTO RE, S. MATTIA","",24,2]
[225,"S. CESARIO, S. VITTORINO","",25,2]
[226,"S. ROMEO","",26,2]
[227,"S. LEANDRO","",27,2]
[228,"S. ROMANO ABATE","",28,2]
[229,"S. GIUSTO","",29,2]
[301,"S. ALBINO","",1,3]
[302,"S. BASILEO MARTIRE","",2,3]
[303,"S. CUNEGONDA","",3,3]
[304,"S. CASIMIRO , S. LUCIO","",4,3]
[305,"S. ADRIANO","",5,3]
[306,"S. GIORDANO","",6,3]
[307,"S. FELICITA, S. PERPETUA","",7,3]
[308,"S. GIOVANNI DI DIO","",8,3]
[309,"S. FRANCESCA R.","",9,3]
[310,"S. SIMPLICIO PAPA","",10,3]
[311,"S. COSTANTINO","",11,3]
[312,"S. MASSIMILIANO,","",12,3]
[313,"S. ARRIGO, S. EUFRASIA V.","",13,3]
[314,"S. MATILDE REGINA","",14,3]
[315,"S. LONGINO , S. LUISA","",15,3]
[316,"S. ERIBERTO VESCOVO","",16,3]
[317,"S. PATRIZIO","",17,3]
[318,"S. SALVATORE, S. CIRILLO","",18,3]
[319,"S. GIUSEPPE","",19,3]
[320,"S. ALESSANDRA MARTIRE","",20,3]
[321,"S. BENEDETTO","",21,3]
[322,"S. LEA","",22,3]
[323,"S. TURIBIO DI M.","",23,3]
[324,"S. ROMOLO","",24,3]
[325,"ANNUNC. DEL SIGNORE","",25,3]
[326,"S. TEODORO, S. ROMOLO, S. EMANUELE","",26,3]
[327,"S. AUGUSTO","",27,3]
[328,"S. SISTO III PAPA","",28,3]
[329,"S. SECONDO MARTIRE","",29,3]
[330,"S. AMEDEO","",30,3]
[331,"S. BENIAMINO MARTIRE","",31,3]
[401,"S. UGO VESCOVO","",1,4]
[402,"S. FRANCESCO DI P.","",2,4]
[403,"S. RICCARDO VESCOVO","",3,4]
[404,"S. ISIDORO VESCOVO","",4,4]
[405,"S. VINCENZO FERRER","",5,4]
[406,"S. GUGLIELMO, S. DIOGENE","",6,4]
[407,"S. ERMANNO","",7,4]
[408,"S. ALBERTO DIONIGI, S. WALTER","",8,4]
[409,"S. MARIA CLEOFE","",9,4]
[410,"S. TERENZIO MARTIRE","",10,4]
[411,"S. STANISLAO VESCOVO","",11,4]
[412,"S. GIULIO PAPA",null,12,4]
[{"$f":"E132*100+D132","v":413},"S. MARTINO PAPA","",13,4]
[414,"S. ABBONDIO","",14,4]
[415,"S. ANNIBALE","",15,4]
[416,"S. LAMBERTO","",16,4]
[417,"S. ANICETO PAPA","",17,4]
[418,"S. GALDINO VESCOVO","",18,4]
[419,"S. ERMOGENE MARTIRE","",19,4]
[420,"S. ADALGISA VERGINE","",20,4]
[421,"S. ANSELMO , S. SILVIO","",21,4]
[422,"S. CAIO","",22,4]
[423,"S. GIORGIO MARTIRE","",23,4]
[424,"S. FEDELE , S. GASTONE","",24,4]
[425,"S. MARCO EVANGELISTA - ANNIV. LIBERAZIONE","Festa Liberazione",25,4]
[426,"S. CLETO, S. MARCELLINO MART.","",26,4]
[427,"S. ZITA","",27,4]
[428,"S. VALERIA, S. PIETRO CHANEL","",28,4]
[429,"S. CATERINA DA SIENA","",29,4]
[430,"S. PIO V PAPA , S. MARIANO","",30,4]
[501,"SAN GIUSEPPE ARTIGIANO","Festa Lavoro",1,5]
[502,"S. CESARE, S. ATANASIO","",2,5]
[503,"S. FILIPPO, S. GIACOMO","",3,5]
[504,"S. SILVANO, S. NEREO","",4,5]
[505,"S. PELLEGRINO MARTIRE","",5,5]
[506,"S. GIUDITTA MARTIRE","",6,5]
[507,"S. FLAVIA , S. FULVIO","",7,5]
[508,"S. DESIDERATO, S. VITTORE M.","",8,5]
[509,"S. GREGORIO V., S.E DUILIO","",9,5]
[510,"S. ANTONINO , S. CATALDO","",10,5]
[511,"S. FABIO MARTIRE","",11,5]
[512,"S. ROSSANA","",12,5]
[513,"S. EMMA","",13,5]
[514,"S. MATTIA AP.","",14,5]
[515,"S. TORQUATO , S. ACHILLE","",15,5]
[516,"S. UBALDO VESCOVO","",16,5]
[517,"S. PASQUALE CONF.","",17,5]
[518,"S. GIOVANNI I PAPA","",18,5]
[519,"S. PIETRO DI M.","",19,5]
[520,"S. BERNARDINO DA S.","",20,5]
[521,"S. VITTORIO MARTIRE","",21,5]
[522,"S. RITA DA CASCIA","",22,5]
[523,"S. DESIDERIO VESCOVO","",23,5]
[524,"B.V. MARIA AUSILIATRICE","",24,5]
[525,"S. BEDA CONF. , S. URBANO","",25,5]
[526,"S. FILIPPO NERI","",26,5]
[527,"S. AGOSTINO","",27,5]
[528,"S. EMILIO M. , S. ERCOLE","",28,5]
[529,"S. MASSIMINO VESCOVO","",29,5]
[530,"S. FELICE I PAPA, S. FERDINANDO","",30,5]
[531,"VISITAZ. B.M.V.","",31,5]
[601,"S. GIUSTINO MARTIRE","",1,6]
[602,"FESTA DELLA REPUBBLICA - S. MARCELLINO","",2,6]
[603,"S. CARLO L.LIST","",3,6]
[604,"S. QUIRINO VESCOVO","",4,6]
[605,"S. BONIFACIO VESCOVO","",5,6]
[606,"S. NORBERTO VESCOVO","",6,6]
[607,"S. ROBERTO VESCOVO","",7,6]
[608,"S. MEDARDO VESCOVO","",8,6]
[609,"S. PRIMO, S. EFREM","",9,6]
[610,"S. DIANA, S. MARCELLA","",10,6]
[611,"S. BARNABA AP.","",11,6]
[612,"S. GUIDO, S. ONOFRIO","",12,6]
[613,"S. ANTONIO DA P.","",13,6]
[614,"S. ELISEO","",14,6]
[615,"S. GERMANA , S. VITO","",15,6]
[{"$f":"E196*100+D196","v":616},"S. AURELIANO","",16,6]
[617,"S. GREGORIO B. , S. ADOLFO","",17,6]
[618,"S. MARINA","",18,6]
[619,"S. GERVASIO, S. ROMUALDO AB.","",19,6]
[620,"S. SILVERIO PAPA , S. ETTORE","",20,6]
[621,"S. LUIGI GONZAGA","",21,6]
[622,"S. PAOLINO DA NOLA","",22,6]
[623,"S. LANFRANCO VESCOVO","",23,6]
[624,"NATIV. S. GIOVANNI B.","",24,6]
[625,"S. GUGLIELMO AB.","",25,6]
[626,"S. VIGILIO VESCOVO","",26,6]
[627,"S. CIRILLO D'ALESS.","",27,6]
[628,"S. ATTILIO","",28,6]
[629,"SS. PIETRO E PAOLO","",29,6]
[630,"SS. PRIMI MARTIRI","",30,6]
[701,"S. TEOBALDO EREM.","",1,7]
[702,"S. OTTONE","",2,7]
[703,"S. TOMMASO AP.","",3,7]
[704,"S. ELISABETTA , S. ROSSELLA","",4,7]
[705,"S. ANTONIO M.Z.","",5,7]
[706,"S. MARIA GORETTI","",6,7]
[707,"S. EDDA, S. CLAUDIO","",7,7]
[708,"S. ADRIANO, S. PRISCILLA","",8,7]
[709,"S. ARMANDO, S. LETIZIA","",9,7]
[710,"S. FELICITA , S. SILVANA","",10,7]
[711,"S. BENEDETTO, S. OLGA, S. FABRIZIO","",11,7]
[712,"S. FORTUNATO MARTIRE","",12,7]
[713,"S. ENRICO IMP.","",13,7]
[714,"S. CAMILLO DE LELLIS","",14,7]
[715,"S. BONAVENTURA","",15,7]
[716,"N.S. DEL CARMELO","",16,7]
[717,"S. ALESSIO CONF.","",17,7]
[718,"S. CALOGERO, S. FEDERICO V.","",18,7]
[719,"S. GIUSTA, S. SIMMACO","",19,7]
[720,"S. ELIA PROF., S. MARGHERITA","",20,7]
[721,"S. LORENZO DA B.","",21,7]
[722,"S. MARIA MADDALENA","",22,7]
[723,"S. BRIGIDA","",23,7]
[724,"S. CRISTINA","",24,7]
[725,"S. GIACOMO AP.","",25,7]
[726,"SS. ANNA E GIOACCHINO","",26,7]
[727,"S. LILIANA , S. AURELIO","",27,7]
[728,"S. NAZARIO , S. INNOCENZO","",28,7]
[729,"S. MARTA","",29,7]
[730,"S. PIETRO CRISOLOGO","",30,7]
[731,"S. IGNAZIO DI L.","",31,7]
[801,"S. ALFONSO","",1,8]
[802,"S. EUSEBIO , S. GUSTAVO","",2,8]
[803,"S. LIDIA","",3,8]
[804,"S. NICODEMO, S. GIOVANNI M.V.","",4,8]
[805,"S. OSVALDO","",5,8]
[806,"TRASFIGURAZ. N.S.","",6,8]
[807,"S. GAETANO DA T.","",7,8]
[808,"S. DOMENICO CONF.","",8,8]
[809,"S. ROMANO, S. FERMO","",9,8]
[810,"S. LORENZO MARTIRE","",10,8]
[811,"S. CHIARA","",11,8]
[812,"S. GIULIANO","",12,8]
[813,"S. IPPOLITO, S. PONZIANO","",13,8]
[814,"S. ALFREDO","",14,8]
[815,"ASSUNZIONE MARIA VERGINE","Ferragosto",15,8]
[816,"S. STEFANO , S. ROCCO","",16,8]
[817,"S. GIACINTO CONFESSORE","",17,8]
[818,"S. ELENA IMP.","",18,8]
[{"$f":"E260*100+D260","v":819},"S. LUDOVICO , S. ITALO","",19,8]
[820,"S. BERNARDO ABATE","",20,8]
[821,"S. PIO X","",21,8]
[822,"S. MARIA REGINA","",22,8]
[823,"S. ROSA DA LIMA , S. MANLIO","",23,8]
[824,"S. BARTOLOMEO AP.","",24,8]
[825,"S. LUDOVICO","",25,8]
[826,"S. ALESSANDRO MARTIRE","",26,8]
[827,"S. MONICA , S. ANITA","",27,8]
[828,"S. AGOSTINO","",28,8]
[829,"MARTIRIO S. GIOVANNI B.","",29,8]
[830,"S. FAUSTINA, S. TECLA","",30,8]
[831,"S. ARISTIDE MARTIRE","",31,8]
[901,"S. EGIDIO ABATE","",1,9]
[902,"S. ELPIDIO VESCOVO","",2,9]
[903,"S. GREGORIO M. , S. MARINO","",3,9]
[904,"S. ROSALIA","",4,9]
[905,"S. VITTORINO VESCOVO","",5,9]
[906,"S. PETRONIO, S. UMBERTO","",6,9]
[907,"S. REGINA","",7,9]
[908,"NATIV. B.V. MARIA","",8,9]
[909,"S. SERGIO PAPA, S. GORGONIO","",9,9]
[910,"S. NICOLA DA TOL., S. PULCHERIA","",10,9]
[911,"S. DIOMEDE MARTIRE","",11,9]
[912,"SS. NOME DI MARIA, S. GUIDO","",12,9]
[913,"S. MAURILIO, S. GIOVANNI CRIS.","",13,9]
[914,"ESALTAZ. S. CROCE","",14,9]
[915,"B.V. ADDOLORATA","",15,9]
[916,"S. CORNELIO E CIPRIANO","",16,9]
[917,"S. ROBERTO B.","",17,9]
[918,"S. SOFIA M.","",18,9]
[919,"S. GENNARO VESCOVO","",19,9]
[920,"S. EUSTACHIO, S. CANDIDA",null,20,9]
[921,"S. MATTEO APOSTOLO","",21,9]
[922,"S. MAURIZIO MARTIRE","",22,9]
[923,"S. PIO DA PIETRELCINA","1Mo GG d'Autunno",23,9]
[924,"S. PACIFICO CONF.","",24,9]
[925,"S. AURELIA","",25,9]
[926,"SS. COSIMO E DAMIANO","",26,9]
[927,"S. VINCENZO DE P.","",27,9]
[928,"S. VENCESLAO MARTIRE","",28,9]
[929,"SS. MICHELE, GABRIELE E RAFFAELE","",29,9]
[930,"S. GIROLAMO DOTTORE","",30,9]
[1001,"S. TERESA DEL B.G.","",1,10]
[1002,"SS. ANGELI CUSTODI","festa dei nonni",2,10]
[1003,"S. GERARDO AB.","",3,10]
[1004,"S. FRANCESCO D'ASSISI","patrono d'Italia",4,10]
[1005,"S. PLACIDO MARTIRE","",5,10]
[1006,"S. BRUNO AB.","",6,10]
[1007,"N.S. DEL ROSARIO","",7,10]
[1008,"S. PELAGIA, S. REPARATA","",8,10]
[1009,"S. DIONIGI , S. FERRUCCIO","",9,10]
[1010,"S. DANIELE M.","",10,10]
[1011,"S. FIRMINO VESCOVO","",11,10]
[1012,"S. SERAFINO CAPP.","",12,10]
[1013,"S. EDOARDO RE","",13,10]
[1014,"S. CALLISTO I PAPA","",14,10]
[1015,"S. TERESA D'AVILA","",15,10]
[1016,"S. EDVIGE, S. MARGHERITA A., S. GALLO","",16,10]
[1017,"S. IGNAZIO D'A. , S. RODOLFO","",17,10]
[1018,"S. LUCA EVANG.","",18,10]
[1019,"S. ISACCO M. , S. LAURA","",19,10]
[1020,"S. IRENE","",20,10]
[1021,"S. ORSOLA","",21,10]
[{"$f":"E324*100+D324","v":1022},"B.GIOVANNI PAOLO II (Papa)","",22,10]
[1023,"S. GIOVANNI DA C.","",23,10]
[1024,"S. ANTONIO M.C.","",24,10]
[1025,"S. CRISPINO, S. DARIA","",25,10]
[1026,"S. EVARISTO PAPA","",26,10]
[1027,"S. FIORENZO VESCOVO","",27,10]
[1028,"S. SIMONE","",28,10]
[1029,"S. ERMELINDA, S. MASSIMILIANO","",29,10]
[1030,"S. GERMANO VESCOVO","",30,10]
[1031,"S. LUCILLA, S. QUINTINO","",31,10]
[1101,"TUTTI I SANTI","",1,11]
[1102,"COMMEMORAZ. DEFUNTI","",2,11]
[1103,"S. MARTINO, S. SILVIA","",3,11]
[1104,"S. CARLO BORROMEO","giornata forze armate P. Rovato",4,11]
[1105,"S. ZACCARIA PROF.","",5,11]
[1106,"S. LEONARDO ABATE","",6,11]
[1107,"S. ERNESTO ABATE","",7,11]
[1108,"S. GOFFREDO VESCOVO","",8,11]
[1109,"S. ORESTE , S. ORNELLA","",9,11]
[1110,"S. LEONE MAGNO","",10,11]
[1111,"S. MARTINO DI TOURS","",11,11]
[1112,"S. RENATO M. , S. ELSA","",12,11]
[1113,"S. DIEGO, S. OMOBONO","",13,11]
[1114,"S. GIOCONDO VESCOVO","",14,11]
[1115,"S. ALBERTO M. , S. ARTURO","",15,11]
[1116,"S. MARGHERITA DI S.","",16,11]
[1117,"S. ELISABETTA","",17,11]
[1118,"S. ODDONE AB.","",18,11]
[1119,"S. FAUSTO MARTIRE","",19,11]
[1120,"S. Benigno / S. Ottavio","",20,11]
[1121,"PRESENTAZ. B.V. MARIA","",21,11]
[1122,"S. CECILIA V.","",22,11]
[1123,"S. CLEMENTE PAPA","",23,11]
[1124,"CRISTO RE E S. FLORA","",24,11]
[1125,"S. CATERINA D'ALESS.","",25,11]
[1126,"S. CORRADO VESCOVO","",26,11]
[1127,"S. MASSIMO , S. VIRGILIO","",27,11]
[1128,"S. GIACOMO FRANC.","",28,11]
[1129,"S. SATURNINO MARTIRE","",29,11]
[1130,"S. ANDREA AP. , S. DUCCIO","",30,11]
[1201,"S. ANSANO","",1,12]
[1202,"S. BIBIANA , S. SAVINO","",2,12]
[1203,"S. FRANCESCO SAVERIO","",3,12]
[1204,"S. BARBARA, S. GIOVANNI DAM.","",4,12]
[1205,"S. GIULIO M.","",5,12]
[1206,"S. NICOLA VESCOVO","",6,12]
[1207,"S. AMBROGIO VESCOVO","",7,12]
[1208,"IMMACOLATA CONCEZIONE","",8,12]
[1209,"S. SIRO","",9,12]
[1210,"N.S. DI LORETO","",10,12]
[1211,"S. DAMASO PAPA","",11,12]
[1212,"S. GIOVANNA F.","",12,12]
[1213,"S. LUCIA V.","",13,12]
[1214,"S. GIOVANNI D.CR., S. POMPEO","",14,12]
[1215,"S. VALERIANO","",15,12]
[1216,"S. ALBINA","",16,12]
[1217,"S. LAZZARO","",17,12]
[1218,"S. GRAZIANO VESCOVO","",18,12]
[1219,"S. FAUSTA , S. DARIO","",19,12]
[1220,"S. LIBERATO MARTIRE","",20,12]
[1221,"S. PIETRO CANISIO","",21,12]
[1222,"S. FRANCESCA CABRINI","",22,12]
[1223,"S. GIOVANNI DA K., S. VITTORIA","",23,12]
[1224,"S. DELFINO","",24,12]
[{"$f":"E388*100+D388","v":1225},"NATALE DEL SIGNORE",null,25,12]
[1226,"S. STEFANO PROTOM.",null,26,12]
[1227,"S. GIOVANNI AP.",null,27,12]
[1228,"SS. INNOCENTI MARTIRI",null,28,12]
[1229,"S. TOMMASO BECKET",null,29,12]
[1230,"S. EUGENIO V. , S. RUGGERO",null,30,12]
[1231,"S. SILVESTRO PAPA","Ultimo Dell' Anno",31,12]

{"sheet":"Archivio","index":2,"n_rows":222,"n_cols":60,"rows_kept":222,"cut":false,"hidden":false,"merged":[[0,8,0,17],[0,20,0,22],[0,24,0,26]]}
[{"$f":"MAX($A$3:$A$6049)","v":9994},{"$f":"IFERROR(VLOOKUP(A1,$A$3:$B$5049,2,0),\"\")","v":127},{"$f":"IFERROR(VLOOKUP($A$1,$A$3:$C$5049,3,0),\"\")","v":"2021-10-23"},null,null,null,null,null,"Archivio Lotto  ",null,null,null,null,null,null,null,null,null,"Dal",null,{"$f":"$C$3","v":"2020-05-30"},null,null,"al",{"$f":"$C$1","v":"2021-10-23"},null,null,null,null,null,null,null,null,null,null,38]
["Record","Pr","Data","Bari",null,null,null,null,"Cagliari",null,null,null,null,"Firenze",null,null,null,null,"Genova",null,null,null,null,"Milano",null,null,null,null,"Napoli",null,null,null,null,"Palermo",null,null,null,null,"Roma",null,null,null,null,"Torino",null,null,null,null,"Venezia",null,null,null,null,"Nazionale"]
[9775,47,"2020-05-30",60,36,84,30,73,41,42,31,55,70,66,79,32,77,55,54,83,39,65,43,21,53,19,90,63,41,2,58,85,3,52,45,10,14,40,32,27,36,15,13,66,49,45,55,81,2,12,77,88,54,82,79,33,55,45]
[9776,48,"2020-06-03",31,54,23,65,77,25,89,33,52,10,44,2,15,55,90,52,19,86,46,51,51,89,79,75,27,9,56,35,85,28,38,86,19,61,41,80,40,70,6,69,31,72,82,50,20,45,82,52,12,89,31,9,22,15,46]
[9777,49,"2020-06-04",66,16,84,79,42,12,89,70,50,65,10,14,28,58,27,74,68,77,64,31,85,64,15,67,28,33,80,12,11,20,42,24,79,45,48,52,77,39,1,56,66,20,62,64,26,31,30,66,68,88,25,10,89,39,18]
[9778,50,"2020-06-06",68,48,37,22,27,33,52,81,56,3,73,81,75,67,35,27,54,21,40,72,31,11,58,16,79,23,88,80,73,28,77,59,2,3,4,68,85,73,24,34,25,46,17,52,84,15,60,64,51,72,3,46,25,9,5]
[9779,51,"2020-06-09",43,81,72,33,69,50,68,89,13,28,80,6,24,46,14,52,66,1,71,27,62,20,13,15,66,3,75,47,72,31,81,52,47,38,77,1,45,79,89,31,87,49,38,68,28,70,7,74,54,26,20,5,74,82,70]
[9780,52,"2020-06-11",48,33,53,35,86,1,40,18,28,5,67,9,35,47,64,19,25,31,27,42,40,72,2,5,44,47,62,84,66,14,32,66,1,80,56,10,30,81,3,57,88,64,15,46,2,41,80,35,42,68,15,82,77,28,66]
[9781,53,"2020-06-13",47,29,83,23,35,52,59,47,90,58,39,27,69,57,66,56,60,84,13,15,61,9,63,14,20,71,22,31,34,38,48,77,14,71,61,68,70,10,39,86,20,53,90,69,66,84,28,5,13,56,57,7,52,84,75]
[9782,54,"2020-06-16",90,22,52,65,67,26,71,70,49,65,59,40,18,36,42,31,78,8,15,65,58,14,48,5,7,39,46,79,59,19,83,53,13,45,41,37,2,26,28,20,76,18,15,8,67,89,2,46,48,87,24,68,54,31,10]
[9783,55,"2020-06-18",33,9,46,78,65,37,90,11,58,16,77,49,86,19,73,29,83,53,45,35,19,15,82,41,88,62,65,60,8,66,48,7,74,32,27,44,27,52,31,13,69,37,60,15,81,45,23,90,80,41,5,30,61,78,55]
[9784,56,"2020-06-20",32,73,29,80,14,41,59,30,79,22,66,47,1,13,49,8,67,13,59,55,13,57,37,53,59,78,18,63,83,61,57,25,26,48,65,90,68,34,54,50,52,74,26,66,44,64,36,74,51,16,75,43,24,25,88]
[9785,57,"2020-06-23",16,20,55,66,51,65,15,88,51,86,42,38,48,90,14,60,24,9,65,5,20,88,79,73,27,43,9,75,23,2,46,10,38,49,42,70,27,22,40,12,25,28,15,11,66,78,31,47,65,55,42,78,10,65,69]
[9786,58,"2020-06-25",26,50,20,27,64,52,36,25,37,9,63,31,41,50,7,30,48,85,81,68,80,15,77,29,90,47,67,51,85,80,88,28,46,29,13,89,75,74,46,48,7,22,8,51,11,65,90,14,71,53,56,52,31,86,17]
[9787,59,"2020-06-27",2,41,33,40,88,33,49,72,78,86,85,2,54,35,12,23,19,20,49,40,9,32,82,4,1,43,47,49,45,3,18,45,79,2,65,21,14,35,9,64,87,59,67,65,81,1,20,55,66,51,47,90,35,48,81]
[9788,60,"2020-06-30",24,74,68,69,45,74,32,58,1,84,50,63,60,11,69,86,82,34,68,29,20,63,71,75,11,17,27,76,15,57,37,61,25,68,10,85,61,54,7,43,51,53,1,44,41,77,22,85,32,69,13,75,44,72,10]
[9789,61,"2020-07-02",73,64,20,32,57,34,78,85,12,32,13,2,73,9,36,10,33,67,28,56,33,5,40,81,35,59,9,63,70,18,67,72,9,65,47,11,63,59,49,83,64,67,63,2,84,64,19,8,65,12,32,55,40,64,84]
[9790,62,"2020-07-04",87,44,78,34,62,54,86,73,43,3,40,1,34,67,50,41,11,84,14,80,30,81,59,43,42,61,21,32,34,31,53,70,47,69,79,72,50,58,35,10,35,67,2,77,1,70,38,77,67,27,29,74,45,86,61]
[9791,63,"2020-07-07",78,54,63,51,49,70,3,20,57,60,65,32,57,81,52,43,66,36,76,1,50,22,54,86,85,88,44,31,6,8,82,4,88,31,59,7,70,90,83,86,71,15,8,73,27,82,62,87,73,59,16,76,18,75,42]
[9792,64,"2020-07-09",14,87,1,29,50,9,81,57,28,36,26,46,59,33,17,6,2,77,17,71,22,7,21,76,19,7,3,69,17,54,52,8,42,26,12,68,9,47,69,26,73,53,13,54,4,90,74,87,45,88,79,12,62,72,56]
[9793,65,"2020-07-11",61,70,43,74,79,35,90,63,30,10,59,60,70,24,11,1,57,53,63,10,77,40,13,58,83,2,40,88,61,90,2,80,3,87,63,27,14,76,66,72,50,90,7,23,89,38,60,29,89,31,2,26,63,77,48]
[9794,66,"2020-07-14",24,40,10,8,36,77,42,15,74,81,78,86,18,25,10,26,1,56,51,49,49,79,60,23,72,49,84,88,48,85,26,11,81,87,34,43,69,35,21,47,37,9,85,6,5,76,47,54,12,65,23,60,2,17,43]
[9795,67,"2020-07-16",12,59,20,60,27,86,66,90,44,10,18,35,47,66,2,28,79,64,63,26,59,80,39,64,38,18,82,86,89,44,15,81,30,40,51,54,43,8,26,28,50,66,24,60,4,29,18,30,89,15,75,43,50,83,42]
[9796,68,"2020-07-18",45,48,9,11,2,23,85,29,5,34,60,34,84,66,70,42,44,4,62,32,32,41,31,16,23,2,73,34,29,90,30,13,38,82,66,12,16,19,72,13,63,90,45,21,64,45,50,80,43,55,13,81,66,47,25]
[9797,69,"2020-07-21",86,33,47,58,83,88,60,27,34,54,72,68,50,73,56,85,3,2,20,52,68,37,59,29,73,73,48,2,63,8,73,61,52,33,25,17,57,28,24,89,48,69,23,89,4,19,32,35,29,20,74,45,85,6,7]
[9798,70,"2020-07-23",61,7,77,64,25,41,78,15,8,12,82,33,31,18,32,35,46,32,19,84,40,84,80,76,62,49,42,25,2,53,69,65,10,40,44,41,29,49,70,37,52,65,62,12,38,61,38,17,16,23,20,61,5,68,2]
[9799,71,"2020-07-25",39,2,71,66,3,67,20,32,82,6,2,41,14,17,61,90,28,1,69,10,69,40,64,58,12,52,90,34,60,54,40,13,49,43,66,90,80,81,44,75,31,45,86,23,79,52,33,84,42,56,49,25,19,7,17]
[9800,72,"2020-07-28",35,61,6,37,66,48,56,21,87,22,45,46,5,47,60,3,53,48,43,36,45,82,30,68,26,21,76,77,7,19,70,65,63,20,40,54,5,53,25,21,3,10,2,18,34,38,30,13,76,10,82,53,19,66,81]
[9801,73,"2020-07-30",18,52,16,17,70,30,11,45,21,78,77,2,61,4,76,62,16,63,73,78,52,68,35,69,70,58,12,38,59,26,56,35,88,33,18,64,34,84,77,33,64,18,45,79,1,77,90,12,88,86,12,81,3,20,6]
[9802,74,"2020-08-01",76,69,56,19,61,1,57,40,51,30,22,5,79,48,60,65,51,1,62,2,22,10,34,9,19,73,2,31,15,79,68,45,87,55,71,78,1,67,74,21,83,36,67,23,76,32,30,58,43,66,21,67,77,32,13]
[9803,75,"2020-08-04",37,51,75,89,6,18,44,89,16,17,43,22,24,45,87,79,19,2,68,34,19,8,85,12,48,83,4,82,76,7,16,80,78,6,66,26,17,50,23,35,83,7,77,43,33,11,81,73,68,33,54,5,69,84,25]
[9804,76,"2020-08-06",17,88,49,90,62,39,59,66,24,21,58,64,4,29,79,58,11,19,35,4,38,12,70,4,19,50,66,43,87,55,25,22,52,62,5,79,28,20,64,46,42,49,5,14,41,24,73,22,46,19,58,76,81,64,59]
[9805,77,"2020-08-08",67,68,65,64,79,58,72,16,48,60,9,44,66,48,10,13,20,34,41,9,87,73,59,32,15,74,58,75,71,11,30,38,81,20,32,29,52,41,48,28,61,78,71,76,25,63,24,82,40,52,22,60,68,69,53]
[9806,78,"2020-08-11",39,20,62,35,7,34,70,31,37,66,82,28,43,48,47,13,70,7,8,69,52,15,2,35,14,19,41,78,11,47,57,56,65,20,40,6,10,44,72,11,52,30,56,9,81,43,52,3,26,10,52,69,60,64,6]
[9807,79,"2020-08-13",85,14,3,88,26,75,85,81,77,13,69,86,10,60,36,2,57,16,9,59,83,6,51,18,46,75,80,20,52,47,64,5,73,89,88,67,2,60,74,63,83,42,23,3,35,83,87,86,72,88,12,77,42,19,32]
[9808,80,"2020-08-17",50,48,30,74,14,59,56,67,57,23,18,26,39,68,44,24,87,6,52,77,21,72,15,40,2,54,65,76,39,63,64,24,72,58,67,53,89,62,90,56,34,45,55,70,28,62,75,53,21,26,45,79,15,89,78]
[9809,81,"2020-08-18",20,39,57,89,22,70,50,54,65,16,1,44,47,4,22,72,71,39,49,42,59,16,86,57,26,80,30,22,42,60,55,7,9,80,45,70,4,81,65,15,44,76,80,4,16,65,31,2,22,15,36,90,75,59,21]
[9810,82,"2020-08-20",21,52,23,56,2,61,29,49,79,30,28,56,9,81,86,8,48,36,38,84,35,52,34,86,83,53,7,59,68,60,38,71,3,86,57,53,13,3,44,59,63,8,88,54,73,28,38,66,22,63,68,29,38,87,54]
[9811,83,"2020-08-22",10,74,25,57,65,67,8,82,80,71,49,55,32,77,64,64,62,52,2,41,6,87,88,51,75,11,77,48,52,85,40,16,47,89,50,63,30,55,84,7,1,85,57,47,19,85,83,42,6,36,70,59,72,82,4]
[9812,84,"2020-08-25",77,72,10,53,34,24,19,53,37,68,69,33,31,36,46,47,13,49,2,14,11,1,52,16,83,7,58,2,73,25,27,14,90,74,13,30,79,51,35,46,35,47,20,7,15,78,24,84,81,51,74,35,30,1,3]
[9813,85,"2020-08-27",31,55,80,47,40,72,64,43,22,51,14,3,37,84,78,17,60,79,6,2,40,49,57,42,23,33,54,63,53,31,72,83,5,3,63,57,52,54,51,80,46,9,68,65,85,83,48,58,19,71,44,55,84,86,33]
[9814,86,"2020-08-29",61,19,89,53,56,63,80,48,19,53,89,78,25,87,14,52,68,32,81,74,13,3,52,65,63,81,45,67,66,20,58,76,35,36,25,79,76,73,67,18,40,56,26,2,47,82,9,50,24,33,59,75,37,21,39]
[9815,87,"2020-09-01",61,20,27,74,52,31,46,32,62,25,56,51,48,87,29,75,69,87,89,56,35,63,81,90,16,43,74,32,70,48,45,12,89,65,10,60,56,27,79,71,37,71,72,11,44,75,23,74,39,46,86,7,9,80,45]
[9816,88,"2020-09-03",19,2,16,36,56,82,26,87,47,75,66,55,85,44,35,81,88,30,7,15,30,34,42,46,58,28,70,47,61,51,84,89,79,71,56,38,57,71,27,5,58,53,22,16,30,69,67,84,54,41,6,2,88,70,39]
[9817,89,"2020-09-05",5,50,39,64,15,43,83,23,50,76,1,74,82,6,63,87,4,31,16,58,25,86,33,24,5,3,21,50,7,13,26,14,65,62,86,32,26,43,33,17,17,49,1,36,56,44,79,68,66,34,6,10,25,90,47]
[9818,90,"2020-09-08",13,6,24,58,38,56,51,34,37,36,35,61,68,82,15,69,47,3,49,83,71,23,1,7,47,59,4,25,18,41,54,80,34,61,30,68,69,64,66,23,34,1,74,26,53,19,90,65,21,70,86,72,18,51,4]
[9819,91,"2020-09-10",60,58,72,22,14,76,53,55,86,16,25,65,84,41,4,89,86,40,47,51,74,50,66,75,1,7,63,60,44,28,38,63,41,83,39,67,37,35,82,72,70,34,83,77,14,74,77,79,54,19,74,18,37,45,64]
[9820,92,"2020-09-12",87,74,26,66,13,58,37,56,72,86,89,5,47,37,71,3,38,1,47,69,64,9,89,27,33,14,17,63,75,20,6,29,77,9,2,83,77,89,62,35,53,32,29,39,66,21,42,60,83,39,34,10,9,2,6]
[9821,93,"2020-09-15",85,84,65,30,18,38,80,55,43,21,24,8,13,14,1,72,70,8,26,73,65,50,88,59,26,45,50,29,8,38,74,52,37,33,39,32,74,48,78,36,33,34,60,79,64,8,16,29,14,34,62,85,2,64,31]
[9822,94,"2020-09-17",77,23,45,54,86,57,81,85,39,21,12,86,38,52,81,71,11,62,85,12,10,47,71,45,58,88,50,77,54,33,29,32,27,4,28,22,14,21,19,64,57,12,78,67,62,4,37,70,3,79,52,80,15,13,59]
[9823,95,"2020-09-19",18,20,9,74,3,22,72,21,74,66,55,7,37,27,8,35,89,31,8,67,77,87,48,33,41,53,78,88,10,20,29,39,26,51,54,42,32,33,28,83,53,46,62,1,90,71,27,49,89,64,60,73,34,10,78]
[9824,96,"2020-09-22",7,10,21,80,4,25,9,4,29,78,8,57,19,82,62,49,40,51,23,79,72,84,69,13,7,26,28,47,16,79,33,70,28,79,29,6,82,34,70,9,49,30,26,2,70,33,43,37,19,8,53,72,55,78,68]
[9825,97,"2020-09-24",4,30,73,82,79,32,17,7,74,66,65,41,23,88,85,79,78,60,88,73,22,69,2,80,27,59,53,67,13,86,81,90,39,11,65,53,72,39,54,52,62,70,10,54,82,52,43,10,80,75,17,23,52,76,78]
[9826,98,"2020-09-26",14,86,85,68,16,31,45,42,79,21,74,69,10,63,35,67,32,79,36,66,89,59,36,77,90,58,33,6,18,56,30,19,62,90,17,33,70,35,75,21,15,20,57,21,35,36,29,71,15,26,73,2,20,72,10]
[9827,99,"2020-09-29",26,24,40,80,49,7,33,55,89,81,53,20,13,75,41,19,47,62,29,6,82,17,24,21,50,39,2,72,42,78,4,74,78,38,61,19,14,20,90,82,47,41,57,70,2,33,48,75,23,49,56,16,62,43,15]
[9828,100,"2020-10-01",88,21,77,69,70,11,15,74,51,4,30,8,68,32,37,3,21,15,42,36,25,87,17,6,78,73,43,87,18,52,24,72,33,87,85,82,14,74,8,2,26,90,31,3,5,31,40,48,63,29,18,87,29,13,10]
[9829,101,"2020-10-03",90,48,11,49,31,7,56,50,62,63,74,88,65,46,66,60,28,22,39,72,64,86,68,65,82,6,35,61,74,51,35,44,48,25,67,68,43,57,88,49,14,84,49,79,75,36,90,12,24,74,62,10,34,17,4]
[9830,102,"2020-10-06",17,24,26,12,18,80,86,46,81,74,85,34,65,50,83,14,90,63,35,83,43,17,25,6,49,44,72,46,76,80,83,87,24,54,35,83,39,25,19,36,48,7,47,70,6,84,65,79,32,16,2,28,41,4,34]
[9831,103,"2020-10-08",71,49,2,50,88,49,61,70,33,48,60,71,2,22,88,30,10,56,38,5,78,29,30,36,15,53,19,76,4,88,83,85,55,31,84,81,58,46,52,60,53,36,85,87,52,47,72,52,79,15,58,69,54,83,71]
[9832,104,"2020-10-10",49,57,23,84,18,1,41,36,73,17,4,18,29,76,81,31,83,57,90,32,56,45,74,71,7,42,61,40,51,53,60,36,84,50,1,16,14,18,13,78,19,62,85,78,11,20,55,39,45,84,82,32,88,84,89]
[9833,105,"2020-10-13",83,66,9,89,16,80,81,15,9,54,57,39,80,3,52,47,75,78,4,84,35,18,75,25,66,13,62,40,31,56,23,59,30,65,27,22,8,77,49,60,78,14,20,38,8,71,39,10,78,83,22,27,56,86,87]
[9834,106,"2020-10-15",6,9,89,86,27,5,61,54,3,41,12,60,26,18,39,5,45,9,71,34,36,84,7,30,23,43,48,79,27,39,39,29,21,53,74,22,63,73,9,83,68,30,44,71,65,21,39,32,35,19,47,33,65,21,18]
[9835,107,"2020-10-17",47,24,50,84,17,19,11,50,89,68,44,7,43,23,11,27,24,60,34,5,27,31,10,14,47,21,40,24,68,85,67,4,11,63,49,28,32,49,81,72,50,28,40,22,18,21,49,29,47,12,90,32,20,10,63]
[9836,108,"2020-10-20",79,28,63,61,45,28,34,81,48,89,29,27,12,37,17,56,55,44,30,7,47,90,64,49,14,34,19,84,65,5,88,57,87,10,18,29,11,2,16,65,70,61,29,47,25,1,76,78,77,74,65,57,24,40,34]
[9837,109,"2020-10-22",70,31,13,7,89,71,72,5,37,13,10,86,25,29,79,53,34,69,60,33,66,90,4,86,47,89,71,31,5,32,10,28,73,56,76,13,65,18,84,25,14,15,70,18,49,35,78,23,32,18,2,43,32,64,84]
[9838,110,"2020-10-24",40,30,77,81,51,87,17,62,70,86,25,23,35,16,58,74,59,40,37,16,73,39,57,36,25,72,6,50,77,68,58,63,65,54,38,58,67,20,84,13,88,45,51,66,77,82,62,60,58,24,62,26,9,2,68]
[9839,111,"2020-10-27",88,72,12,87,49,22,20,56,59,30,5,39,74,53,86,57,72,7,46,2,88,40,30,33,38,23,14,11,90,20,12,18,89,6,20,76,3,45,20,44,64,30,43,69,16,56,60,32,17,46,59,74,12,50,54]
[9840,112,"2020-10-29",26,78,70,83,51,62,21,12,11,44,48,38,85,90,79,81,57,25,32,34,13,49,15,82,27,31,9,27,24,33,8,25,31,86,40,10,6,39,57,85,77,39,71,74,22,67,76,29,28,56,30,40,42,26,16]
[9841,113,"2020-10-31",83,79,69,87,59,65,47,52,43,7,80,9,50,63,30,49,39,64,11,25,72,82,64,6,9,28,72,33,87,40,48,33,7,12,62,32,20,83,48,40,63,35,73,2,28,23,8,37,27,35,44,25,81,72,77]
[9842,114,"2020-11-03",89,2,13,67,57,44,67,27,81,5,82,29,16,13,47,28,61,15,20,90,23,28,15,71,37,66,39,25,81,51,57,30,35,64,18,81,72,20,9,19,25,42,20,54,17,10,29,13,35,17,18,57,39,52,46]
[9843,115,"2020-11-05",66,85,12,38,77,30,13,58,43,79,18,67,52,42,63,61,12,66,74,89,90,58,73,26,33,72,38,43,70,42,73,22,67,24,69,39,38,42,61,4,83,12,45,61,55,64,83,52,28,68,83,58,76,38,5]
[9844,116,"2020-11-07",84,83,14,11,8,31,40,27,62,39,87,20,59,22,80,6,64,2,26,61,77,85,58,79,87,10,56,18,46,44,50,10,61,14,40,63,81,16,54,84,52,49,31,58,34,89,83,54,67,12,16,38,48,73,11]
[9845,117,"2020-11-10",54,64,49,45,65,45,10,76,1,69,34,6,76,2,50,20,66,4,23,63,24,6,75,74,39,69,6,51,4,8,22,31,63,8,35,85,90,33,67,5,25,80,75,88,18,65,53,45,17,75,21,46,55,37,47]
[9846,118,"2020-11-12",77,20,34,21,52,30,9,63,20,33,32,16,2,63,29,16,3,11,30,40,44,84,72,58,78,28,12,88,60,77,61,74,71,7,13,78,37,19,35,90,27,62,34,76,31,36,90,58,66,57,44,56,69,12,1]
[9847,119,"2020-11-14",20,23,34,18,72,34,89,36,57,18,3,67,47,15,5,39,47,4,15,3,5,12,4,29,60,15,50,90,31,38,25,26,8,42,76,6,45,74,12,78,26,36,49,67,2,45,87,21,63,46,11,86,71,13,3]
[9848,120,"2020-11-17",15,82,83,61,29,14,78,41,38,83,61,44,80,22,89,31,86,75,13,25,74,75,40,24,60,34,74,35,20,38,27,67,47,36,9,31,75,4,30,57,80,53,7,11,12,50,67,65,18,7,58,74,69,73,32]
[9849,121,"2020-11-19",43,51,8,70,76,89,37,84,79,30,51,4,27,37,36,22,67,42,51,48,56,24,28,79,23,57,27,74,41,2,11,2,61,69,84,1,9,42,11,63,81,49,78,33,15,69,18,25,37,43,88,8,69,82,33]
[9850,122,"2020-11-21",47,67,9,60,21,67,76,61,81,78,7,43,4,16,61,34,79,89,25,15,10,69,46,17,60,86,89,19,24,49,57,76,85,47,54,38,57,55,23,67,49,29,75,36,51,52,67,2,64,42,84,26,11,6,60]
[9851,123,"2020-11-24",56,45,69,74,10,3,75,10,33,68,6,46,45,22,66,21,90,46,69,56,58,56,44,45,21,20,32,7,62,56,48,20,22,38,66,84,61,37,4,73,31,27,16,64,38,45,18,13,75,82,52,82,57,61,7]
[9852,124,"2020-11-26",15,72,17,27,6,67,27,63,44,78,80,71,1,59,16,73,36,34,52,5,4,77,44,43,31,53,3,4,24,90,52,53,46,71,64,39,8,5,33,62,66,12,47,68,6,88,57,66,52,34,4,80,34,76,45]
[9853,125,"2020-11-28",61,80,40,26,16,14,12,83,85,28,76,40,31,53,61,58,2,50,34,30,86,62,14,54,23,81,26,19,35,9,26,39,31,16,51,11,58,68,23,85,59,74,88,1,22,35,57,28,36,90,26,80,87,36,77]
[9854,126,"2020-12-01",65,80,1,13,85,51,71,84,16,65,65,64,1,35,85,47,74,46,56,18,54,90,5,23,53,42,89,17,67,25,77,1,54,76,29,32,89,76,64,28,88,86,63,68,26,43,42,15,46,35,42,19,50,25,29]
[9855,127,"2020-12-03",27,31,12,54,68,54,63,16,57,73,34,54,62,53,39,88,79,33,39,19,14,34,51,50,47,71,82,13,77,5,1,24,51,71,65,79,15,80,4,8,88,55,14,50,3,25,85,27,55,81,44,64,45,54,68]
[9856,128,"2020-12-05",21,65,7,84,13,71,65,72,89,24,76,68,71,35,34,2,28,62,73,79,49,48,47,24,61,28,48,25,58,44,48,28,43,53,34,9,38,84,33,51,39,3,66,60,30,30,53,27,38,58,78,31,82,75,3]
[9857,129,"2020-12-09",30,74,23,68,65,26,30,89,88,3,20,33,70,51,39,58,66,87,27,35,32,41,52,25,89,69,54,75,68,15,15,78,60,24,90,15,52,4,24,55,11,50,5,30,48,23,52,3,72,68,13,37,53,39,12]
[9858,130,"2020-12-10",80,71,22,85,17,18,84,2,37,62,18,17,66,30,46,19,26,1,69,17,5,84,29,81,61,19,49,80,16,9,51,85,84,29,40,3,53,17,64,58,10,18,33,36,43,38,7,81,20,15,10,64,13,9,55]
[9859,131,"2020-12-12",29,27,11,6,89,14,63,54,66,87,84,60,51,47,40,11,20,48,75,64,28,78,64,21,27,64,36,63,80,59,44,32,30,41,23,86,44,11,57,50,63,46,71,7,89,74,87,81,16,38,34,55,76,51,88]
[9860,132,"2020-12-15",16,89,13,35,60,26,61,50,17,83,17,88,54,41,6,25,35,11,1,70,87,76,55,18,9,70,15,58,62,31,84,25,89,62,31,85,7,31,78,16,16,86,48,75,43,87,45,44,61,65,65,41,34,90,8]
[9861,133,"2020-12-17",30,24,69,7,55,16,43,13,49,81,82,50,39,72,48,88,52,60,36,25,15,29,80,42,75,88,85,58,45,75,6,71,90,87,13,70,67,50,57,79,30,23,5,67,40,1,63,34,22,36,46,23,33,27,61]
[9862,134,"2020-12-19",38,53,50,59,75,59,67,31,15,50,74,25,45,32,17,23,43,58,8,16,48,16,7,25,15,5,79,49,14,76,20,53,24,56,44,56,6,1,73,61,79,6,69,18,88,27,73,63,71,85,14,32,15,17,29]
[9863,135,"2020-12-22",85,51,74,44,30,82,27,21,6,89,47,46,60,63,28,63,90,40,28,34,5,59,37,53,73,16,78,65,33,83,39,35,36,79,80,67,8,81,49,23,31,2,81,64,18,37,6,82,54,60,85,8,78,48,13]
[9864,136,"2020-12-24",56,17,30,3,15,60,37,84,30,81,74,15,8,42,55,84,26,4,59,25,54,67,13,46,89,35,20,83,32,22,41,13,2,53,73,58,74,71,50,24,8,60,79,47,72,24,47,55,52,29,10,28,76,63,88]
[9865,137,"2020-12-28",62,66,89,42,27,16,79,54,82,44,21,7,49,34,13,25,86,54,3,64,61,1,41,37,36,40,32,65,8,10,37,26,54,88,8,65,77,76,59,79,17,23,20,25,89,57,52,36,80,89,10,43,90,18,16]
[9866,138,"2020-12-29",88,58,67,27,14,58,13,70,83,48,30,90,57,88,21,16,59,74,33,28,71,18,87,85,40,31,54,70,90,51,21,17,30,46,18,54,34,10,65,33,20,58,62,38,51,88,37,45,60,62,58,61,19,26,40]
[9867,139,"2020-12-31",44,55,41,85,29,31,66,8,2,30,34,72,43,60,9,41,36,72,73,49,13,39,18,24,83,80,78,16,83,65,23,40,11,22,73,46,11,20,41,27,67,32,4,85,88,66,77,20,22,10,55,49,5,45,33]
[9868,1,"2021-01-02",36,62,47,72,85,7,21,63,75,50,83,21,53,63,56,65,10,27,20,82,14,55,76,80,65,78,36,48,60,84,48,42,75,47,78,33,71,46,63,89,78,66,42,82,54,38,55,69,70,83,23,15,46,85,83]
[9869,2,"2021-01-05",24,37,69,26,35,15,79,12,16,52,47,30,33,18,6,41,18,40,25,39,14,40,1,8,19,27,33,26,80,41,26,83,15,77,50,34,24,25,18,90,85,3,79,50,84,39,58,71,37,30,46,65,78,11,79]
[9870,3,"2021-01-07",47,5,59,7,41,7,1,68,30,84,28,84,59,50,70,52,10,60,65,76,69,47,4,7,33,80,55,26,90,63,8,22,9,23,17,71,4,31,13,87,72,82,18,7,67,51,48,35,24,64,83,7,35,48,57]
[9871,4,"2021-01-09",25,87,48,88,8,53,59,47,24,67,76,42,84,61,85,6,67,51,85,55,79,3,29,30,68,4,53,7,83,19,28,12,25,49,71,69,5,29,86,68,23,45,60,58,43,86,68,34,50,73,87,45,3,4,51]
[9872,5,"2021-01-12",90,85,78,75,64,15,82,13,17,79,36,88,14,5,11,84,51,20,38,71,50,6,84,72,25,33,16,13,53,56,20,49,44,30,78,28,21,5,90,88,42,47,36,15,53,22,38,2,43,75,36,38,87,40,58]
[9873,6,"2021-01-14",9,40,47,26,49,34,64,43,78,31,45,32,17,65,37,65,10,81,28,29,59,46,84,58,3,84,41,81,25,4,20,58,29,9,69,56,73,61,64,3,19,1,6,34,39,8,85,30,45,83,65,71,45,73,35]
[9874,7,"2021-01-16",20,1,13,6,50,42,34,14,21,44,63,46,80,4,5,84,38,72,89,90,83,90,45,54,27,58,45,68,44,4,42,86,57,71,45,51,46,8,18,90,90,76,28,26,7,38,80,73,1,21,73,38,4,23,64]
[9875,8,"2021-01-19",82,32,35,54,87,19,27,10,60,86,58,65,62,37,90,56,35,87,6,59,29,68,45,15,70,47,26,5,81,52,15,85,84,20,65,83,64,75,36,78,7,59,68,44,61,79,22,80,83,17,69,38,23,16,52]
[9876,9,"2021-01-21",18,43,19,69,15,17,27,61,9,76,69,63,81,26,61,89,36,7,81,66,39,82,74,12,40,7,53,5,73,88,27,58,8,52,19,17,38,39,40,29,66,90,17,74,29,8,12,88,40,87,71,21,54,79,77]
[9877,10,"2021-01-23",53,48,56,25,3,77,9,19,18,56,69,46,88,53,22,22,49,74,62,55,7,20,30,51,33,29,35,79,4,65,7,72,47,44,79,62,17,46,47,33,56,29,25,9,67,53,17,26,19,4,69,42,25,41,52]
[9878,11,"2021-01-26",21,55,1,42,88,75,28,81,6,88,53,63,35,90,83,3,64,78,66,60,31,48,47,8,37,87,65,76,42,54,85,64,66,20,78,61,31,45,60,20,35,83,53,81,11,17,26,45,77,61,13,49,82,80,47]
[9879,12,"2021-01-28",52,41,5,39,51,84,3,32,41,45,79,53,77,47,38,22,87,63,24,88,29,80,4,2,28,81,38,82,17,89,62,81,58,60,33,68,26,66,27,28,43,67,42,30,7,11,17,57,83,4,61,37,69,26,82]
[9880,13,"2021-01-30",40,27,73,30,67,37,79,1,44,3,5,54,82,63,81,53,49,28,70,56,10,84,47,81,44,48,54,37,44,84,30,6,65,32,78,64,74,60,86,18,63,5,23,85,21,36,83,4,21,50,61,52,63,15,41]
[9881,14,"2021-02-02",38,87,12,59,1,62,21,77,41,28,77,89,27,62,26,20,10,87,13,28,76,68,56,4,82,22,31,9,82,49,48,54,6,55,27,72,9,52,31,41,25,21,69,74,46,10,6,54,51,75,16,71,9,85,89]
[9882,15,"2021-02-04",46,2,84,50,61,62,77,61,43,76,29,45,13,9,46,30,70,79,8,39,85,68,11,62,40,77,60,46,71,25,78,77,17,18,90,18,4,12,87,76,24,6,51,82,89,63,69,45,7,30,8,35,63,57,84]
[9883,16,"2021-02-06",28,22,88,83,70,35,7,52,72,77,19,25,58,65,35,31,52,87,27,71,32,22,27,14,28,75,19,28,80,62,36,78,82,86,45,68,50,73,11,67,26,36,53,52,21,49,61,2,12,47,62,27,5,57,19]
[9884,17,"2021-02-09",13,11,88,20,64,65,27,7,51,26,6,63,64,35,44,26,27,76,11,72,53,43,86,2,50,15,1,5,60,75,4,85,60,57,63,77,79,10,18,72,17,74,66,12,30,64,23,32,72,66,16,10,68,12,55]
[9885,18,"2021-02-11",42,28,49,67,33,16,80,54,39,32,67,31,75,74,29,43,87,29,46,24,48,38,85,41,59,5,57,37,15,61,26,39,48,4,5,5,21,27,17,66,76,83,20,22,13,30,51,13,23,67,5,49,29,54,83]
[9886,19,"2021-02-13",86,81,70,77,8,31,48,66,68,89,86,21,17,45,25,78,66,77,16,63,1,45,29,15,9,89,38,1,66,46,16,75,79,43,49,61,49,11,56,74,71,42,15,76,85,34,18,14,31,29,16,47,27,71,4]
[9887,20,"2021-02-16",45,70,52,19,33,65,10,7,56,34,45,85,46,49,90,81,50,31,15,56,14,50,22,63,78,41,31,83,49,29,32,11,63,4,45,90,37,61,15,44,11,14,51,15,58,84,85,52,53,56,34,36,55,44,68]
[9888,21,"2021-02-18",81,20,56,41,65,64,85,90,71,48,41,90,78,63,40,40,45,26,76,89,72,38,7,83,47,54,74,12,31,25,3,71,57,74,10,47,58,12,34,7,79,39,83,65,89,39,23,42,78,82,54,17,12,62,61]
[9889,22,"2021-02-20",58,87,55,79,71,61,80,41,1,64,10,37,82,17,63,24,1,54,67,69,74,73,35,43,23,9,4,39,81,38,90,68,10,29,13,34,69,21,54,27,57,58,67,21,70,67,29,70,56,83,90,84,12,1,13]
[9890,23,"2021-02-23",42,65,37,2,23,31,72,86,37,33,86,84,68,42,71,1,89,70,42,20,20,18,88,65,87,16,11,48,38,69,81,34,65,68,59,43,50,79,72,89,41,86,18,31,87,13,53,37,49,60,55,71,68,9,87]
[9891,24,"2021-02-25",17,74,14,27,5,45,35,88,47,48,58,42,19,3,88,42,52,19,1,51,31,54,70,34,61,48,47,77,17,40,26,30,23,69,3,52,83,82,17,16,62,85,88,40,43,26,68,39,63,42,53,40,89,33,47]
[9892,25,"2021-02-27",17,75,30,79,64,85,30,22,73,55,44,75,83,32,26,14,47,72,89,82,37,20,87,78,38,56,39,72,21,50,45,64,6,38,17,13,47,43,39,10,63,34,60,64,58,1,7,4,65,44,34,72,32,89,73]
[9893,26,"2021-03-02",74,86,47,24,75,61,25,88,49,60,5,46,65,22,1,48,69,78,67,64,15,42,8,44,35,6,67,37,30,9,17,11,20,46,89,73,25,66,1,74,37,4,33,5,88,60,75,53,70,11,28,64,11,75,88,null,"="]
[9894,27,"2021-03-04",24,23,64,69,25,81,36,90,73,47,4,48,63,14,42,45,69,89,81,50,36,44,39,10,23,31,14,50,30,23,13,74,37,9,79,54,14,23,70,40,6,35,55,39,20,69,1,34,89,77,15,24,31,80,13]
[9895,28,"2021-03-06",80,51,6,35,76,17,84,66,64,67,18,83,51,4,64,45,39,62,67,11,15,51,70,21,48,73,10,4,54,3,59,41,83,21,22,7,56,66,15,24,51,46,19,18,1,4,73,38,36,13,38,11,44,31,17]
[9896,29,"2021-03-09",57,15,66,90,12,71,90,12,72,38,63,2,22,40,10,28,62,52,46,89,41,2,4,84,35,86,44,77,68,2,86,30,67,74,87,63,11,62,44,26,13,42,39,34,51,49,29,80,51,59,75,44,37,71,90]
[9897,30,"2021-03-11",78,53,71,66,50,27,51,25,80,55,2,37,18,41,47,32,77,84,86,16,58,76,79,36,39,61,90,81,3,35,54,56,35,64,7,77,23,44,63,24,44,3,40,38,69,26,34,48,54,21,17,11,65,8,13]
[9898,31,"2021-03-13",29,56,77,74,31,60,59,29,89,63,69,57,42,71,21,26,63,32,71,59,26,66,6,55,60,63,79,42,32,81,3,30,13,12,11,71,44,13,6,48,56,58,37,18,24,3,49,65,5,70,45,31,8,56,51]
[9899,32,"2021-03-16",51,46,32,47,50,85,9,41,50,23,53,29,45,18,64,36,27,39,25,4,25,51,20,63,50,42,81,9,5,78,26,84,29,10,34,56,25,81,52,89,29,4,58,33,79,69,65,71,30,83,27,86,45,53,81]
[9900,33,"2021-03-18",12,48,59,32,88,64,50,3,62,76,22,23,85,18,7,33,57,10,39,14,13,49,10,27,14,5,64,46,9,32,70,43,85,13,50,52,60,85,54,69,74,10,12,29,30,15,50,30,70,63,78,68,7,26,28]
[9901,34,"2021-03-20",55,11,84,76,72,57,16,44,87,63,70,90,83,17,80,37,78,26,41,70,58,81,24,25,13,13,79,76,46,17,82,7,4,30,35,37,73,34,47,36,72,23,13,81,18,67,15,47,48,43,7,8,52,28,27]
[9902,35,"2021-03-23",15,53,52,55,12,48,39,84,1,74,69,39,3,13,82,75,79,26,42,1,17,61,70,38,25,40,13,60,59,73,64,65,87,5,34,43,84,14,80,37,68,53,7,32,45,3,54,77,4,85,64,90,21,67,49]
[9903,36,"2021-03-25",55,50,56,46,52,29,70,2,33,19,18,87,62,50,21,49,40,74,87,7,1,54,9,52,88,54,65,35,25,15,81,56,45,76,78,63,51,49,31,62,82,13,23,63,62,46,80,69,14,29,16,10,38,72,46]
[9904,37,"2021-03-27",2,66,86,76,79,42,26,15,68,53,35,49,16,2,17,45,1,51,65,78,83,80,40,30,31,15,72,29,71,38,65,52,77,12,36,20,14,22,23,72,1,20,15,68,70,14,48,84,80,60,55,24,25,3,1]
[9905,38,"2021-03-30",72,61,88,9,86,47,50,12,75,40,14,13,62,69,43,21,66,55,68,14,18,23,37,10,35,59,80,64,26,27,67,39,24,21,58,83,5,50,68,13,5,31,2,25,27,56,41,8,43,39,53,75,56,58,2]
[9906,39,"2021-04-01",30,50,89,51,31,58,47,89,23,70,10,57,9,40,33,30,74,70,36,8,89,80,56,53,43,21,47,27,88,58,61,51,45,18,23,33,32,15,44,55,9,78,24,53,86,78,33,79,56,53,68,10,86,70,43]
[9907,40,"2021-04-03",15,78,49,19,12,5,87,25,71,39,35,13,51,1,21,40,44,33,62,10,15,44,73,63,65,31,41,86,29,77,75,40,18,27,3,51,10,37,59,38,23,17,56,4,37,38,24,39,89,15,50,40,84,73,38]
[9908,41,"2021-04-06",53,28,38,56,87,51,75,21,39,41,19,8,22,86,48,80,40,2,24,72,77,21,14,27,11,55,41,42,59,77,5,82,84,29,28,59,41,79,24,84,68,74,29,25,73,1,21,44,11,40,86,12,89,62,15]
[9909,42,"2021-04-08",24,19,57,21,42,81,32,60,28,54,86,77,81,12,75,1,31,78,45,72,45,46,57,3,49,48,7,56,69,1,11,56,12,61,75,34,74,13,53,33,80,68,23,88,19,76,34,78,28,90,45,69,76,54,6]
[9910,43,"2021-04-10",56,82,66,18,11,49,20,83,38,22,36,68,83,66,32,42,34,85,17,26,53,17,14,80,60,70,85,57,81,90,82,43,89,85,52,30,43,2,61,80,51,55,89,81,23,70,29,54,32,27,50,21,69,43,73]
[9911,44,"2021-04-13",51,83,12,48,64,7,47,19,78,34,35,75,2,12,46,36,48,67,77,87,68,49,15,79,73,32,39,60,78,66,22,75,25,78,82,42,49,90,27,84,15,85,78,24,44,1,22,82,55,61,90,38,27,86,55]
[9912,45,"2021-04-15",26,57,56,51,6,73,76,88,52,15,29,15,72,63,84,60,90,46,24,42,26,40,75,3,55,6,79,84,89,73,1,14,42,54,68,34,37,4,30,65,76,90,41,17,40,27,4,25,51,37,17,30,7,24,49]
[9913,46,"2021-04-17",59,61,41,4,32,10,68,19,11,85,41,1,13,73,47,44,30,39,88,90,67,88,33,13,32,44,41,79,80,66,15,59,4,31,21,46,68,56,78,58,9,15,84,17,32,81,4,84,42,35,52,16,63,62,46]
[9914,47,"2021-04-20",48,4,61,77,26,72,80,64,55,30,34,87,46,4,28,47,35,52,89,18,84,56,20,7,5,89,8,10,69,77,28,43,75,23,10,50,57,21,69,17,39,43,66,41,85,21,7,48,12,80,81,72,39,18,37]
[9915,48,"2021-04-22",60,21,2,8,47,61,19,59,69,56,66,3,75,21,51,2,73,76,6,15,70,5,32,64,84,23,26,24,8,29,32,68,73,48,30,50,61,67,24,70,1,28,26,67,71,23,86,54,45,90,15,40,12,29,46]
[9916,49,"2021-04-24",35,10,18,76,54,65,71,26,5,31,80,90,7,20,61,82,80,57,61,54,50,67,16,28,9,47,77,36,68,66,10,71,73,83,43,60,78,49,58,82,71,81,46,44,23,60,9,90,56,86,36,64,35,57,17]
[9917,50,"2021-04-27",36,50,56,73,41,4,34,67,32,46,32,70,40,33,22,63,47,71,21,38,80,7,62,55,88,3,75,20,12,29,70,64,35,34,54,25,89,14,51,77,87,74,73,47,60,8,84,9,10,2,23,83,1,89,17]
[9918,51,"2021-04-29",87,52,49,10,51,69,67,76,66,24,30,43,10,57,66,37,80,57,35,26,18,3,76,16,24,30,46,73,69,18,71,17,14,63,82,28,89,10,9,86,28,6,61,81,54,20,68,28,88,45,89,84,34,80,73]
[9919,52,"2021-05-03",42,57,78,18,43,17,52,50,63,38,70,21,50,5,2,23,26,62,83,86,36,12,76,57,8,57,83,30,56,63,66,49,40,59,28,63,49,83,58,59,4,3,79,68,51,50,29,2,89,11,47,76,5,19,62]
[9920,53,"2021-05-04",30,10,84,47,64,17,25,88,85,63,81,15,86,80,11,67,37,23,24,64,53,87,28,3,48,53,79,77,76,83,21,26,4,65,76,31,6,65,40,62,82,87,21,53,79,88,58,75,15,83,63,90,5,11,68]
[9921,54,"2021-05-06",29,63,52,60,85,81,1,26,41,70,12,38,33,57,36,29,38,79,37,66,78,44,32,66,75,50,43,15,29,16,72,70,5,53,50,1,69,57,36,47,26,69,63,68,42,87,71,31,79,52.8852040816327,27,18,39,61,86]
[9922,55,"2021-05-08",68,5,34,17,43,58,67,4,53,82,35,25,9,60,3,30,52,41,78,83,65,37,45,70,42,45,22,88,25,75,53,18,58,16,7,42,36,88,67,59,25,13,20,77,30,46,35,11,17,14,28,27,57,25,42]
[9923,56,"2021-05-11",77,67,73,28,63,19,90,43,50,31,31,6,41,47,56,38,86,53,26,10,59,54,68,86,18,20,85,57,49,37,74,11,17,63,55,60,33,28,51,15,73,65,35,82,36,71,76,28,53,59,4,84,70,31,15]
[9924,57,"2021-05-13",23,13,56,9,71,70,73,5,8,66,58,17,47,64,22,68,43,9,2,19,32,38,89,47,80,53,29,42,44,47,79,20,54,15,90,50,38,72,41,26,56,18,27,75,41,62,76,41,63,44,90,24,38,37,55]
[9925,58,"2021-05-15",88,8,23,43,3,60,4,47,24,82,38,41,44,79,86,26,62,27,69,85,60,29,33,15,80,86,1,90,58,2,72,33,57,21,51,75,39,89,88,40,41,28,84,30,80,67,6,28,18,13,64,80,35,26,32]
[9926,59,"2021-05-18",29,19,46,72,23,49,87,14,85,82,33,7,63,13,44,88,32,40,77,21,70,59,85,62,80,42,19,1,28,24,90,79,26,39,48,79,47,77,17,71,17,8,50,74,87,4,49,63,10,85,83,75,13,44,25]
[9927,60,"2021-05-20",18,28,45,62,58,57,88,70,15,87,86,30,5,58,52,9,81,5,20,35,67,47,52,13,5,11,56,37,3,84,51,71,10,25,60,7,71,90,35,77,67,58,31,29,4,19,35,55,5,63,30,70,61,7,4]
[9928,61,"2021-05-22",38,81,12,87,34,71,39,63,35,56,20,28,29,76,72,57,83,18,55,62,29,65,56,45,13,7,59,19,48,73,59,34,62,49,40,90,49,80,79,20,2,68,45,34,42,53,60,87,6,23,86,69,74,85,26]
[9929,62,"2021-05-25",75,43,1,56,31,27,50,80,39,11,16,32,52,40,81,85,65,54,90,30,39,18,66,52,12,14,9,75,7,28,70,16,69,50,36,27,5,1,12,8,26,46,2,6,31,82,68,63,37,47,45,8,26,35,5]
[9930,63,"2021-05-27",38,7,87,3,66,75,31,56,32,72,76,83,9,82,52,74,61,70,5,83,27,6,41,13,88,65,12,67,90,72,22,43,14,58,51,69,62,16,60,55,85,89,72,14,25,52,73,81,76,20,51,6,12,46,41]
[9931,64,"2021-05-29",13,29,37,63,53,56,28,61,55,82,86,73,69,35,9,43,18,52,3,81,77,33,59,88,54,54,71,38,22,65,69,67,82,6,40,77,55,68,49,18,73,54,86,52,35,85,10,81,54,53,15,71,12,21,74]
[9932,65,"2021-06-01",60,46,72,47,9,67,70,53,48,5,67,19,35,36,66,64,72,55,87,89,52,89,50,1,75,36,19,13,4,77,88,64,22,72,77,55,47,11,89,3,58,86,12,69,11,29,47,34,76,69,48,75,31,3,43]
[9933,66,"2021-06-03",22,86,81,65,75,59,74,20,28,55,79,81,32,12,23,79,4,54,83,76,89,49,34,53,48,51,80,57,38,27,74,7,49,32,90,12,90,32,50,67,4,46,90,40,80,14,79,12,36,52,87,77,41,76,48]
[9934,67,"2021-06-05",86,51,57,79,65,65,89,46,54,68,82,6,80,10,84,70,15,60,28,64,4,85,78,83,68,38,29,6,25,11,65,23,63,6,49,52,49,30,18,84,55,42,10,85,11,73,71,23,49,88,62,71,54,2,67]
[9935,68,"2021-06-08",47,6,11,33,41,34,77,52,20,70,49,66,87,27,39,64,50,55,35,76,38,21,89,48,16,34,73,40,22,53,36,53,72,19,84,6,7,42,17,63,31,58,24,62,47,65,20,89,44,66,13,55,44,20,61]
[9936,69,"2021-06-10",72,6,63,79,86,56,2,43,30,78,87,82,63,17,51,20,5,3,44,59,19,78,38,33,82,16,30,62,77,36,4,66,33,30,61,88,82,60,32,69,61,60,67,51,4,25,14,35,74,54,57,84,15,58,47]
[9937,70,"2021-06-12",70,15,3,11,34,28,25,2,5,37,79,69,31,52,40,57,7,50,41,30,24,44,71,60,38,72,39,62,85,35,81,86,1,4,89,18,29,41,82,83,55,27,36,16,73,50,61,38,72,7,42,25,60,51,61]
[9938,71,"2021-06-15",88,81,53,41,90,2,56,59,9,11,13,77,62,12,31,28,44,6,85,10,8,53,1,75,18,89,14,60,11,16,9,38,50,3,79,66,71,24,62,36,58,81,17,60,18,83,30,13,6,66,37,27,30,87,65]
[9939,72,"2021-06-17",27,38,71,15,84,68,28,19,22,76,20,18,40,45,12,15,70,56,29,16,38,63,77,12,33,27,74,63,36,90,75,80,10,66,74,12,80,53,37,29,7,71,47,82,75,74,42,85,78,47,7,18,17,31,47]
[9940,73,"2021-06-19",7,21,15,54,27,25,2,28,72,53,68,83,46,61,15,54,24,45,75,53,36,13,58,1,50,27,88,2,90,51,39,2,52,20,59,45,80,41,15,33,44,21,86,10,69,48,21,36,58,37,52,86,75,9,69]
[9941,74,"2021-06-22",38,69,47,22,46,84,37,9,20,5,65,83,1,8,46,44,41,67,54,77,5,78,84,60,89,88,32,53,54,86,3,31,67,21,7,13,86,2,24,83,45,64,89,7,74,63,64,21,27,53,2,17,19,70,41]
[9942,75,"2021-06-24",43,50,77,49,59,86,42,69,70,65,36,33,56,15,6,12,57,5,58,78,13,66,89,55,10,87,61,26,13,15,8,77,44,73,45,23,25,86,48,76,22,51,81,3,10,37,59,79,90,42,19,77,66,72,82]
[9943,76,"2021-06-26",27,69,3,1,12,51,47,16,18,22,45,63,55,38,85,15,59,33,83,44,63,58,86,34,45,81,52,89,12,20,24,69,8,27,1,86,14,58,78,19,44,51,36,14,20,6,76,24,11,54,3,38,73,10,49]
[9944,77,"2021-06-29",83,51,84,34,5,83,31,27,55,52,84,9,44,8,66,29,4,84,52,40,80,50,76,26,6,49,85,82,14,76,25,41,47,48,55,2,83,35,27,82,9,30,4,16,53,6,15,46,47,27,42,31,70,66,51]
[9945,78,"2021-07-01",81,85,48,86,38,36,27,25,69,84,35,36,70,18,15,31,9,4,58,21,38,49,39,29,40,35,31,61,4,5,67,15,12,41,45,70,15,59,55,78,84,42,69,34,73,28,59,52,11,76,47,60,66,31,28]
[9946,79,"2021-07-03",11,80,24,90,81,12,19,24,9,66,7,86,63,6,11,24,38,76,80,37,68,80,29,23,41,61,39,68,7,1,28,17,83,71,50,34,21,45,72,85,15,11,13,82,43,60,39,71,87,50,23,66,6,7,82]
[9947,80,"2021-07-06",80,18,70,39,65,21,50,7,42,76,53,75,15,86,27,10,88,66,30,32,16,43,9,42,21,77,29,75,42,67,7,36,40,86,71,20,37,16,25,68,46,5,3,22,74,48,17,34,1,70,60,49,27,88,46]
[9948,81,"2021-07-08",30,4,62,33,44,12,13,47,63,15,61,20,19,77,29,46,45,21,69,7,17,73,34,48,81,59,52,22,50,46,25,3,19,20,75,80,4,56,3,30,74,78,10,32,47,46,66,74,30,44,45,78,7,57,42]
[9949,82,"2021-07-10",88,33,11,53,51,18,6,35,41,73,77,54,43,58,20,7,79,27,13,32,23,64,89,65,79,55,72,29,77,25,6,20,60,17,69,71,4,46,66,34,29,73,22,30,46,46,4,25,18,50,60,30,6,82,70]
[9950,83,"2021-07-13",90,32,45,44,62,14,41,50,12,84,6,31,60,90,46,51,64,70,69,43,84,66,3,75,34,83,41,1,37,19,71,15,73,55,60,65,84,81,64,7,87,42,2,65,74,4,67,62,30,14,38,43,78,20,64]
[9951,84,"2021-07-15",47,73,44,59,84,4,58,18,37,67,49,59,70,80,64,19,77,83,40,42,50,76,61,38,74,81,38,13,27,9,78,8,4,65,39,85,12,10,9,89,32,17,24,44,6,35,71,76,89,82,88,45,14,33,31]
[9952,85,"2021-07-17",26,9,78,48,22,70,21,35,73,62,85,74,32,27,21,59,25,63,69,52,43,16,19,88,1,59,42,38,41,2,69,54,81,86,37,36,35,61,58,56,37,49,55,26,78,8,47,3,82,88,88,18,26,1,2]
[9953,86,"2021-07-20",27,89,7,65,85,32,18,9,1,56,5,3,75,12,90,10,71,51,17,87,38,57,12,52,40,26,28,4,6,45,13,44,39,87,53,50,22,65,41,7,56,2,59,64,66,89,56,70,19,85,11,35,2,30,58]
[9954,87,"2021-07-22",86,56,14,65,47,59,4,12,64,3,62,74,81,36,48,90,31,20,67,68,65,15,72,33,54,68,79,70,22,72,45,68,38,12,69,10,75,32,59,70,45,66,79,50,38,81,26,9,69,31,77,31,41,58,8]
[9955,88,"2021-07-24",81,2,42,55,79,61,9,15,74,56,4,5,7,35,37,12,42,13,47,34,23,6,39,12,89,22,80,25,24,41,35,42,25,3,23,78,13,56,45,59,61,4,82,65,5,29,67,83,45,85,47,75,12,31,62]
[9956,89,"2021-07-27",50,65,72,26,38,32,59,9,87,25,41,44,86,58,11,19,6,42,4,45,10,22,53,12,54,5,10,41,12,58,48,34,7,29,12,31,76,71,58,67,79,26,59,13,57,84,24,59,64,28,72,85,25,28,55]
[9957,90,"2021-07-29",55,18,78,36,64,14,28,66,39,55,87,3,73,15,24,26,22,28,23,74,23,83,14,72,41,4,15,88,74,86,86,54,45,56,57,24,35,90,25,59,47,40,55,82,18,40,76,63,29,44,65,35,70,64,63]
[9958,91,"2021-07-31",73,10,19,26,34,32,44,13,79,19,49,60,72,31,80,8,85,70,80,83,54,87,85,46,8,14,60,74,81,17,61,6,42,49,75,82,13,58,65,34,52,4,71,68,13,80,34,30,84,86,18,38,75,68,41]
[9959,92,"2021-08-03",29,69,52,80,88,20,69,37,90,54,81,12,45,76,58,38,16,15,20,41,1,56,26,67,18,40,89,71,50,32,21,79,32,71,48,50,83,38,73,77,71,27,11,30,42,8,2,25,53,47,55,31,22,41,48]
[9960,93,"2021-08-05",16,78,19,13,67,24,8,76,11,3,8,75,61,88,60,73,59,7,60,33,83,84,71,8,70,60,32,20,61,66,5,85,51,63,64,46,57,1,10,13,87,51,82,37,67,33,29,40,47,43,7,51,42,81,13]
[9961,94,"2021-08-07",26,39,68,9,29,89,68,14,47,62,46,23,17,44,47,77,45,66,87,67,47,19,20,79,34,6,70,74,73,86,56,39,45,17,50,48,42,81,59,35,69,31,29,67,30,74,84,15,85,14,57,15,6,43,46]
[9962,95,"2021-08-10",81,39,66,7,12,31,55,78,34,8,54,20,64,77,81,9,53,31,34,5,61,2,17,66,78,42,64,52,48,86,44,55,19,78,13,25,24,13,15,11,38,54,47,10,65,4,72,52,90,79,4,62,56,45,35]
[9963,96,"2021-08-12",53,37,86,32,64,15,60,12,63,75,39,29,25,62,56,34,88,2,5,30,71,26,66,74,1,82,42,44,50,65,2,30,10,77,82,81,9,13,47,73,81,6,1,33,58,7,38,56,2,60,29,4,17,49,24]
[9964,97,"2021-08-14",30,13,67,83,65,25,13,80,30,12,36,72,40,20,82,61,83,59,2,29,36,65,19,61,9,81,33,35,25,84,58,23,90,16,8,15,19,29,63,70,4,58,16,18,59,26,80,90,25,63,7,42,34,86,87]
[9965,98,"2021-08-17",84,48,30,61,2,48,12,61,54,73,58,73,21,61,49,1,60,39,36,52,32,39,23,83,43,83,48,52,89,54,37,47,55,36,41,42,20,54,26,71,40,52,22,33,13,51,54,70,35,22,40,30,78,8,20]
[9966,99,"2021-08-19",35,56,53,49,62,2,32,35,79,78,47,17,73,48,46,72,42,27,50,60,20,19,88,3,48,26,27,83,20,32,10,53,76,17,22,39,34,50,59,9,72,39,41,1,50,76,14,82,23,37,83,88,11,68,19]
[9967,100,"2021-08-21",74,41,15,69,9,11,50,53,70,24,4,79,87,50,56,50,47,72,30,76,56,32,27,16,36,1,71,74,29,6,80,14,84,60,9,28,31,50,88,18,53,15,42,84,71,18,75,56,86,25,19,29,28,86,35]
[9968,101,"2021-08-24",31,32,78,47,66,72,67,3,47,79,56,32,50,34,77,82,5,73,15,11,7,11,22,53,47,51,39,36,21,90,1,40,14,5,8,11,13,39,69,50,61,87,82,27,21,55,34,3,53,27,24,60,20,35,59]
[9969,102,"2021-08-26",2,23,12,15,55,75,42,49,36,63,82,49,69,80,68,52,79,44,38,85,9,32,80,35,38,53,54,87,43,26,39,22,5,40,34,59,38,36,41,66,75,26,69,37,32,20,67,88,90,41,30,83,77,29,87]
[9970,103,"2021-08-28",78,36,23,68,86,58,9,25,53,60,80,47,68,12,52,84,1,73,85,6,64,87,60,83,57,54,14,42,37,41,51,35,30,39,21,30,22,55,51,75,75,73,82,86,36,66,72,19,23,7,62,22,86,18,10]
[9971,104,"2021-08-31",22,57,32,43,79,1,51,26,19,32,59,35,8,53,10,39,15,66,76,75,38,71,69,88,30,44,4,76,32,77,70,16,64,41,81,25,65,84,63,17,47,32,74,19,73,73,62,17,71,27,77,40,80,89,6]
[9972,105,"2021-09-02",34,62,15,63,26,14,36,67,10,25,83,59,28,21,31,85,53,16,20,29,16,86,11,29,76,50,48,70,76,67,83,13,39,61,17,1,40,82,44,22,5,20,8,49,13,71,65,80,36,24,69,36,68,13,3]
[9973,106,"2021-09-04",57,33,68,25,47,47,56,33,63,42,90,10,18,83,32,16,65,1,19,15,20,48,75,17,47,49,28,83,74,77,43,30,59,34,76,59,60,10,52,73,24,21,25,6,67,31,34,79,15,18,55,7,87,84,82]
[9974,107,"2021-09-07",83,12,16,77,60,81,68,24,9,62,4,6,20,68,63,3,69,37,31,21,60,58,45,20,80,57,18,24,29,88,61,32,51,37,47,68,90,74,7,69,35,62,65,60,38,34,72,45,77,78,46,6,35,38,87]
[9975,108,"2021-09-09",29,25,88,56,15,18,89,25,11,22,37,40,10,43,61,45,77,88,62,76,56,74,58,43,54,49,73,21,84,22,29,12,64,10,42,58,27,54,48,9,48,82,28,32,49,1,8,54,12,72,62,71,27,90,89]
[9976,109,"2021-09-11",9,19,54,3,67,19,42,35,76,29,86,23,77,16,42,47,79,65,83,30,37,26,6,43,75,70,49,12,27,21,46,37,47,24,51,72,32,35,82,43,23,86,66,39,44,9,77,53,83,20,23,32,4,67,15]
[9977,110,"2021-09-14",54,80,62,28,21,43,7,21,17,48,60,25,36,55,59,6,22,12,88,85,71,16,28,60,32,54,6,85,28,20,87,42,51,15,41,37,45,40,78,83,29,8,81,23,61,1,32,17,86,67,64,52,24,47,11]
[9978,111,"2021-09-16",74,49,82,32,42,69,58,35,14,19,40,78,51,22,8,50,84,39,30,63,66,70,41,13,62,66,72,40,1,45,39,81,21,79,20,4,31,77,12,45,58,57,45,79,71,80,76,28,17,71,44,31,90,13,7]
[9979,112,"2021-09-18",19,82,17,54,76,7,27,63,75,62,4,76,11,34,66,45,79,12,19,83,85,40,2,52,36,22,82,43,55,4,45,44,31,90,21,2,16,62,49,36,11,16,38,88,9,56,88,52,29,6,52,76,20,25,31]
[9980,113,"2021-09-21",49,53,84,39,57,7,68,79,55,82,90,89,3,49,43,40,36,28,32,68,63,47,87,4,38,6,34,5,62,38,19,41,7,4,53,55,29,35,52,44,12,24,83,53,64,85,38,23,64,49,77,86,10,22,65]
[9981,114,"2021-09-23",52,4,30,13,49,81,77,53,13,7,58,25,33,41,73,9,41,18,31,54,21,8,17,62,15,89,49,88,76,24,84,63,75,22,69,31,16,48,6,76,60,81,46,17,53,64,34,4,55,80,52,37,15,2,47]
[9982,115,"2021-09-25",89,69,62,15,67,35,82,68,43,13,78,70,76,83,45,89,54,33,60,81,2,10,64,77,76,68,37,17,14,19,52,56,59,2,51,4,79,49,37,47,3,32,44,31,49,74,28,85,90,2,51,60,41,31,1]
[9983,116,"2021-09-28",5,19,10,71,11,83,46,17,63,52,44,47,24,41,14,58,43,57,73,61,77,83,34,55,73,90,39,76,85,26,38,10,75,45,53,65,17,45,9,81,77,53,78,39,12,86,90,70,82,25,64,42,71,36,16]
[9984,117,"2021-09-30",1,32,85,20,56,38,26,10,23,87,43,40,55,5,47,40,10,74,53,20,18,51,86,73,22,77,90,25,35,74,40,56,30,34,49,66,50,15,2,73,56,73,30,21,5,33,60,19,58,37,40,58,50,5,32]
[9985,118,"2021-10-02",12,61,87,15,32,44,68,24,35,19,68,86,75,5,57,6,21,54,68,60,21,46,13,5,23,19,35,89,61,56,21,69,33,15,71,13,78,21,42,87,78,57,34,17,43,80,38,78,51,37,83,39,15,3,16]
[9986,119,"2021-10-05",46,19,12,16,7,74,25,21,44,77,83,5,41,40,71,68,69,72,24,44,54,76,17,60,81,20,48,7,4,85,12,19,56,59,34,66,42,79,72,30,45,69,20,56,18,76,31,65,89,90,32,65,67,70,62]
[9987,120,"2021-10-07",56,62,66,53,24,49,43,89,66,27,11,20,36,27,28,79,40,36,48,89,30,15,28,78,86,29,34,64,24,51,1,58,54,72,20,70,33,48,67,52,1,74,78,64,76,5,10,1,31,23,27,82,75,33,78]
[9988,121,"2021-10-09",83,28,88,17,34,25,57,18,90,47,64,22,65,43,87,56,17,3,29,16,38,71,27,40,44,67,24,4,45,41,45,42,15,69,74,77,78,83,16,50,46,55,36,4,27,9,78,80,63,32,77,20,22,55,11]
[9989,122,"2021-10-12",1,56,71,52,49,57,29,83,10,24,35,24,61,69,8,56,39,7,47,80,4,25,43,61,45,48,26,74,82,12,30,26,71,10,88,90,63,31,77,19,55,49,81,53,73,4,82,76,54,89,58,8,76,72,65]
[9990,123,"2021-10-14",54,63,65,41,48,12,47,52,11,78,50,11,79,78,70,60,43,7,18,77,7,34,14,44,2,48,16,13,68,55,11,48,32,57,27,34,88,48,6,74,85,76,9,4,68,53,90,34,47,81,23,53,22,59,46]
[9991,124,"2021-10-16",21,55,66,10,63,75,14,16,48,25,16,33,85,70,39,7,36,37,90,28,26,83,71,69,14,72,59,13,51,60,85,31,41,24,88,9,54,17,1,19,68,1,34,32,18,67,63,19,88,37,32,3,26,24,13]
[9992,125,"2021-10-19",43,44,8,25,33,3,40,53,1,82,2,31,80,6,18,39,60,65,62,57,63,48,12,67,86,56,78,52,26,54,28,29,54,2,18,72,20,51,38,78,2,85,61,24,49,65,33,72,38,85,29,33,42,63,23]
[9993,126,"2021-10-21",82,73,44,34,26,85,70,67,44,34,32,41,14,55,87,20,12,9,69,5,24,1,78,64,38,63,20,9,32,90,79,65,90,57,75,27,70,78,61,39,39,40,28,38,31,89,45,29,30,27,16,47,6,39,71]
[9994,127,"2021-10-23",58,79,45,89,72,24,72,79,73,32,52,61,2,30,87,56,4,77,17,88,62,46,45,24,42,33,4,54,89,56,22,58,11,7,34,38,65,86,63,76,60,28,12,7,63,78,53,21,45,72,9,3,75,52,35]

{"sheet":"Ritardatari","index":3,"n_rows":4951,"n_cols":53,"rows_kept":4951,"cut":false,"hidden":false,"merged":[[25,9,29,9],[0,9,4,9],[5,9,9,9],[10,9,14,9],[15,9,19,9],[20,9,24,9],[30,9,34,9],[35,9,39,9],[40,9,44,9],[45,9,49,9],[50,9,54,9]]}
["Ruota e posiz","Numero","tot","Num ADD","N° IN Ritr",{"$f":"COUNTIF(C2:C1000,0)","v":2},null,1,82,"Bari"]
["GE2",12,0,49,{"$f":"IF(MOD(B2+D2,90),MOD(B2+D2,90),90)","v":61},null,null,2,73,null,null,null,null,null,null,null,null,null,null,null,null,null,null,null,null,null,null,null,null,null,null,null,null,null,null,null,null,null,null,null,null,null,null,null,null,null,null,null,null,null,null,null,"BA1"]
["PA3",90,0,9,9,null,null,3,44,null,null,null,null,null,null,null,null,null,null,null,null,null,null,null,null,null,null,null,null,null,null,null,null,null,null,null,null,null,null,null,null,null,null,null,null,null,null,null,null,null,null,null,"BA2"]
["BA2",null,1,18,18,null,null,4,34,null,null,null,null,null,null,null,null,null,null,null,null,null,null,null,null,null,null,null,null,null,null,null,null,null,null,null,null,null,null,null,null,null,null,null,null,null,null,null,null,null,null,null,"BA3"]
["BA2",null,1,46,46,null,null,5,26,null,null,null,null,null,null,null,null,null,null,null,null,null,null,null,null,null,null,null,null,null,null,null,null,null,null,null,null,null,null,null,null,null,null,null,null,null,null,null,null,null,null,null,"BA4"]
["BA4",null,1,50,50,null,null,1,85,"Cagliari","Ult. Aggior.",null,null,null,null,null,null,null,null,null,null,null,null,null,null,null,null,null,null,null,null,null,null,null,null,null,null,null,null,null,null,null,null,null,null,null,null,null,null,null,null,null,"BA5"]
["FI1",null,1,89,89,null,null,2,70,null,"2021-10-23T22:19:00",null,null,null,null,null,null,null,null,null,null,null,null,null,null,null,null,null,null,null,null,null,null,null,null,null,null,null,null,null,null,null,null,null,null,null,null,null,null,null,null,null,"CA1"]
["GE3",null,1,33,33,null,null,3,67,null,"2021-10-23T22:19:00",null,null,null,null,null,null,null,null,null,null,null,null,null,null,null,null,null,null,null,null,null,null,null,null,null,null,null,null,null,null,null,null,null,null,null,null,null,null,null,null,null,"CA2"]
["GE4",null,1,17,17,null,null,4,44,null,44492.929861111108,null,null,null,null,null,null,null,null,null,null,null,null,null,null,null,null,null,null,null,null,null,null,null,null,null,null,null,null,null,null,null,null,null,null,null,null,null,null,null,null,null,"CA3"]
["GE4",null,1,27,27,null,null,5,34,null,null,null,null,null,null,null,null,null,null,null,null,null,null,null,null,null,null,null,null,null,null,null,null,null,null,null,null,null,null,null,null,null,null,null,null,null,null,null,null,null,null,null,"CA4"]
["GE5",null,1,78,78,null,null,1,32,"Firenze",null,null,null,null,null,null,null,null,null,null,null,null,null,null,null,null,null,null,null,null,null,null,null,null,null,null,null,null,null,null,null,null,null,null,null,null,null,null,null,null,null,null,"CA5"]
["MI1",null,1,2,2,null,null,2,41,null,null,null,null,null,null,null,null,null,null,null,null,null,null,null,null,null,null,null,null,null,null,null,null,null,null,null,null,null,null,null,null,null,null,null,null,null,null,null,null,null,null,null,"FI1"]
["MI4",null,1,55,55,null,null,3,14,null,null,null,null,null,null,null,null,null,null,null,null,null,null,null,null,null,null,null,null,null,null,null,null,null,null,null,null,null,null,null,null,null,null,null,null,null,null,null,null,null,null,null,"FI2"]
["PA2",null,1,61,61,null,null,4,55,null,null,null,null,null,null,null,null,null,null,null,null,null,null,null,null,null,null,null,null,null,null,null,null,null,null,null,null,null,null,null,null,null,null,null,null,null,null,null,null,null,null,null,"FI3"]
["PA2",null,1,68,68,null,null,5,87,null,null,null,null,null,null,null,null,null,null,null,null,null,null,null,null,null,null,null,null,null,null,null,null,null,null,null,null,null,null,null,null,null,null,null,null,null,null,null,null,null,null,null,"FI4"]
["PA4",null,1,14,14,null,null,1,20,"Genova",null,null,null,null,null,null,null,null,null,null,null,null,null,null,null,null,null,null,null,null,null,null,null,null,null,null,null,null,null,null,null,null,null,null,null,null,null,null,null,null,null,null,"FI5"]
["PA4",null,1,52,52,null,null,2,12,null,null,null,null,null,null,null,null,null,null,null,null,null,null,null,null,null,null,null,null,null,null,null,null,null,null,null,null,null,null,null,null,null,null,null,null,null,null,null,null,null,null,null,"GE1"]
["RO1",null,1,86,86,null,null,3,9,null,null,null,null,null,null,null,null,null,null,null,null,null,null,null,null,null,null,null,null,null,null,null,null,null,null,null,null,null,null,null,null,null,null,null,null,null,null,null,null,null,null,null,"GE2"]
["RO2",null,1,1,1,null,null,4,69,null,null,null,null,null,null,null,null,null,null,null,null,null,null,null,null,null,null,null,null,null,null,null,null,null,null,null,null,null,null,null,null,null,null,null,null,null,null,null,null,null,null,null,"GE3"]
["RO2",null,1,62,62,null,null,5,5,null,null,null,null,null,null,null,null,null,null,null,null,null,null,null,null,null,null,null,null,null,null,null,null,null,null,null,null,null,null,null,null,null,null,null,null,null,null,null,null,null,null,null,"GE4"]
["RO4",null,1,17,17,null,null,1,24,"Milano",null,null,null,null,null,null,null,null,null,null,null,null,null,null,null,null,null,null,null,null,null,null,null,null,null,null,null,null,null,null,null,null,null,null,null,null,null,null,null,null,null,null,"GE5"]
["RO4",null,1,90,90,null,null,2,1,null,null,null,null,null,null,null,null,null,null,null,null,null,null,null,null,null,null,null,null,null,null,null,null,null,null,null,null,null,null,null,null,null,null,null,null,null,null,null,null,null,null,null,"MI1"]
["VE1",null,1,90,90,null,null,3,78,null,null,null,null,null,null,null,null,null,null,null,null,null,null,null,null,null,null,null,null,null,null,null,null,null,null,null,null,null,null,null,null,null,null,null,null,null,null,null,null,null,null,null,"MI2"]
["VE5",null,1,2,2,null,null,4,64,null,null,null,null,null,null,null,null,null,null,null,null,null,null,null,null,null,null,null,null,null,null,null,null,null,null,null,null,null,null,null,null,null,null,null,null,null,null,null,null,null,null,null,"MI3"]
["NZ2",null,1,6,6,null,null,5,38,null,null,null,null,null,null,null,null,null,null,null,null,null,null,null,null,null,null,null,null,null,null,null,null,null,null,null,null,null,null,null,null,null,null,null,null,null,null,null,null,null,null,null,"MI4"]
["NZ3",null,1,43,43,null,null,1,63,"Napoli",null,null,null,null,null,null,null,null,null,null,null,null,null,null,null,null,null,null,null,null,null,null,null,null,null,null,null,null,null,null,null,null,null,null,null,null,null,null,null,null,null,null,"MI5"]
["NZ4",null,1,90,90,null,null,2,20,null,null,null,null,null,null,null,null,null,null,null,null,null,null,null,null,null,null,null,null,null,null,null,null,null,null,null,null,null,null,null,null,null,null,null,null,null,null,null,null,null,null,null,"NA1"]
["BA1",null,2,19,19,null,null,3,9,null,null,null,null,null,null,null,null,null,null,null,null,null,null,null,null,null,null,null,null,null,null,null,null,null,null,null,null,null,null,null,null,null,null,null,null,null,null,null,null,null,null,null,"NA2"]
["BA1",null,2,36,36,null,null,4,32,null,null,null,null,null,null,null,null,null,null,null,null,null,null,null,null,null,null,null,null,null,null,null,null,null,null,null,null,null,null,null,null,null,null,null,null,null,null,null,null,null,null,null,"NA3"]
["BA2",null,2,33,33,null,null,5,90,null,null,null,null,null,null,null,null,null,null,null,null,null,null,null,null,null,null,null,null,null,null,null,null,null,null,null,null,null,null,null,null,null,null,null,null,null,null,null,null,null,null,null,"NA4"]
["BA2",null,2,74,74,null,null,1,79,"Palermo",null,null,null,null,null,null,null,null,null,null,null,null,null,null,null,null,null,null,null,null,null,null,null,null,null,null,null,null,null,null,null,null,null,null,null,null,null,null,null,null,null,null,"NA5"]
["BA3",null,2,54,54,null,null,2,65,null,null,null,null,null,null,null,null,null,null,null,null,null,null,null,null,null,null,null,null,null,null,null,null,null,null,null,null,null,null,null,null,null,null,null,null,null,null,null,null,null,null,null,"PA1"]
["BA3",null,2,87,87,null,null,3,90,null,null,null,null,null,null,null,null,null,null,null,null,null,null,null,null,null,null,null,null,null,null,null,null,null,null,null,null,null,null,null,null,null,null,null,null,null,null,null,null,null,null,null,"PA2"]
["BA4",null,2,18,18,null,null,4,57,null,null,null,null,null,null,null,null,null,null,null,null,null,null,null,null,null,null,null,null,null,null,null,null,null,null,null,null,null,null,null,null,null,null,null,null,null,null,null,null,null,null,null,"PA3"]
["BA4",null,2,45,45,null,null,5,75,null,null,null,null,null,null,null,null,null,null,null,null,null,null,null,null,null,null,null,null,null,null,null,null,null,null,null,null,null,null,null,null,null,null,null,null,null,null,null,null,null,null,null,"PA4"]
["BA4",null,2,49,49,null,null,1,27,"Roma",null,null,null,null,null,null,null,null,null,null,null,null,null,null,null,null,null,null,null,null,null,null,null,null,null,null,null,null,null,null,null,null,null,null,null,null,null,null,null,null,null,null,"PA5"]
["BA4",null,2,65,65,null,null,2,70,null,null,null,null,null,null,null,null,null,null,null,null,null,null,null,null,null,null,null,null,null,null,null,null,null,null,null,null,null,null,null,null,null,null,null,null,null,null,null,null,null,null,null,"RO1"]
["BA5",null,2,75,75,null,null,3,78,null,null,null,null,null,null,null,null,null,null,null,null,null,null,null,null,null,null,null,null,null,null,null,null,null,null,null,null,null,null,null,null,null,null,null,null,null,null,null,null,null,null,null,"RO2"]
["CA1",null,2,90,90,null,null,4,61,null,null,null,null,null,null,null,null,null,null,null,null,null,null,null,null,null,null,null,null,null,null,null,null,null,null,null,null,null,null,null,null,null,null,null,null,null,null,null,null,null,null,null,"RO3"]
["CA2",null,2,17,17,null,null,5,39,null,null,null,null,null,null,null,null,null,null,null,null,null,null,null,null,null,null,null,null,null,null,null,null,null,null,null,null,null,null,null,null,null,null,null,null,null,null,null,null,null,null,null,"RO4"]
["CA4",null,2,40,40,null,null,1,39,"Torino",null,null,null,null,null,null,null,null,null,null,null,null,null,null,null,null,null,null,null,null,null,null,null,null,null,null,null,null,null,null,null,null,null,null,null,null,null,null,null,null,null,null,"RO5"]
["CA5",null,2,56,56,null,null,2,40,null,null,null,null,null,null,null,null,null,null,null,null,null,null,null,null,null,null,null,null,null,null,null,null,null,null,null,null,null,null,null,null,null,null,null,null,null,null,null,null,null,null,null,"TO1"]
["CA5",null,2,57,57,null,null,3,28,null,null,null,null,null,null,null,null,null,null,null,null,null,null,null,null,null,null,null,null,null,null,null,null,null,null,null,null,null,null,null,null,null,null,null,null,null,null,null,null,null,null,null,"TO2"]
["CA5",null,2,71,71,null,null,4,38,null,null,null,null,null,null,null,null,null,null,null,null,null,null,null,null,null,null,null,null,null,null,null,null,null,null,null,null,null,null,null,null,null,null,null,null,null,null,null,null,null,null,null,"TO3"]
["FI1",null,2,25,25,null,null,5,31,null,null,null,null,null,null,null,null,null,null,null,null,null,null,null,null,null,null,null,null,null,null,null,null,null,null,null,null,null,null,null,null,null,null,null,null,null,null,null,null,null,null,null,"TO4"]
["FI1",null,2,69,69,null,null,1,89,"Venezia",null,null,null,null,null,null,null,null,null,null,null,null,null,null,null,null,null,null,null,null,null,null,null,null,null,null,null,null,null,null,null,null,null,null,null,null,null,null,null,null,null,null,"TO5"]
["FI2",null,2,4,4,null,null,2,45,null,null,null,null,null,null,null,null,null,null,null,null,null,null,null,null,null,null,null,null,null,null,null,null,null,null,null,null,null,null,null,null,null,null,null,null,null,null,null,null,null,null,null,"VE1"]
["FI3",null,2,24,24,null,null,3,29,null,null,null,null,null,null,null,null,null,null,null,null,null,null,null,null,null,null,null,null,null,null,null,null,null,null,null,null,null,null,null,null,null,null,null,null,null,null,null,null,null,null,null,"VE2"]
["FI4",null,2,34,34,null,null,4,30,null,null,null,null,null,null,null,null,null,null,null,null,null,null,null,null,null,null,null,null,null,null,null,null,null,null,null,null,null,null,null,null,null,null,null,null,null,null,null,null,null,null,null,"VE3"]
["FI4",null,2,37,37,null,null,5,27,null,null,null,null,null,null,null,null,null,null,null,null,null,null,null,null,null,null,null,null,null,null,null,null,null,null,null,null,null,null,null,null,null,null,null,null,null,null,null,null,null,null,null,"VE4"]
["FI4",null,2,55,55,null,null,1,16,"Nazionale",null,null,null,null,null,null,null,null,null,null,null,null,null,null,null,null,null,null,null,null,null,null,null,null,null,null,null,null,null,null,null,null,null,null,null,null,null,null,null,null,null,null,"VE5"]
["FI4",null,2,66,66,null,null,2,47,null,null,null,null,null,null,null,null,null,null,null,null,null,null,null,null,null,null,null,null,null,null,null,null,null,null,null,null,null,null,null,null,null,null,null,null,null,null,null,null,null,null,null,"NZ1"]
["FI5",null,2,21,21,null,null,3,6,null,null,null,null,null,null,null,null,null,null,null,null,null,null,null,null,null,null,null,null,null,null,null,null,null,null,null,null,null,null,null,null,null,null,null,null,null,null,null,null,null,null,null,"NZ2"]
["FI5",null,2,60,60,null,null,4,39,null,null,null,null,null,null,null,null,null,null,null,null,null,null,null,null,null,null,null,null,null,null,null,null,null,null,null,null,null,null,null,null,null,null,null,null,null,null,null,null,null,null,null,"NZ3"]
["FI5",null,2,83,83,null,null,5,71,null,null,null,null,null,null,null,null,null,null,null,null,null,null,null,null,null,null,null,null,null,null,null,null,null,null,null,null,null,null,null,null,null,null,null,null,null,null,null,null,null,null,null,"NZ4"]
["FI5",null,2,87,87,null,null,null,null,null,null,null,null,null,null,null,null,null,null,null,null,null,null,null,null,null,null,null,null,null,null,null,null,null,null,null,null,null,null,null,null,null,null,null,null,null,null,null,null,null,null,null,"NZ5"]
["GE1",null,2,35,35]
["GE1",null,2,53,53]
["GE1",null,2,85,85]
["GE2",null,2,19,19]
["GE3",null,2,22,22]
["GE5",null,2,66,66]
["GE5",null,2,71,71]
["MI1",null,2,72,72]
["MI2",null,2,77,77]
["MI4",null,2,6,{"$f":"IF(MOD(B66+D66,90),MOD(B66+D66,90),90)","v":6}]
["MI4",null,2,49,49]
["MI4",null,2,59,59]
["MI5",null,2,57,57]
["MI5",null,2,77,77]
["NA1",null,2,2,2]
["NA1",null,2,36,36]
["NA1",null,2,41,41]
["NA2",null,2,69,69]
["NA2",null,2,86,86]
["NA3",null,2,5,5]
["NA3",null,2,30,30]
["NA3",null,2,76,76]
["NA4",null,2,38,38]
["NA4",null,2,65,65]
["NA4",null,2,67,67]
["PA2",null,2,51,51]
["PA3",null,2,59,59]
["PA4",null,2,89,89]
["PA5",null,2,32,32]
["PA5",null,2,60,60]
["RO1",null,2,77,77]
["RO2",null,2,21,21]
["RO4",null,2,28,28]
["RO4",null,2,42,42]
["RO4",null,2,80,80]
["RO5",null,2,27,27]
["RO5",null,2,72,72]
["TO1",null,2,54,54]
["TO2",null,2,25,25]
["TO2",null,2,51,51]
["TO3",null,2,71,71]
["TO3",null,2,88,88]
["TO4",null,2,51,51]
["TO5",null,2,5,5]
["TO5",null,2,12,12]
["VE2",null,2,34,34]
["VE2",null,2,47,47]
["VE3",null,2,21,21]
["VE3",null,2,50,50]
["VE4",null,2,3,3]
["VE4",null,2,49,49]
["VE4",null,2,76,76]
["VE5",null,2,73,73]
["NZ1",null,2,90,90]
["NZ2",null,2,8,8]
["NZ3",null,2,44,44]
["NZ3",null,2,82,82]
["NZ5",null,2,41,41]
["NZ5",null,2,57,57]
["NZ5",null,2,84,84]
["BA1",null,3,8,8]
["BA1",null,3,56,56]
["BA1",null,3,82,82]
["BA2",null,3,36,36]
["BA2",null,3,62,62]
["BA2",null,3,71,71]
["BA2",null,3,72,72]
["BA3",null,3,23,23]
["BA3",null,3,27,27]
["BA3",null,3,42,42]
["BA3",null,3,57,57]
["BA3",null,3,83,83]
["BA4",null,3,1,1]
["BA4",null,3,23,{"$f":"IF(MOD(B130+D130,90),MOD(B130+D130,90),90)","v":23}]
["BA4",null,3,24,24]
["BA4",null,3,39,39]
["BA4",null,3,51,51]
["BA4",null,3,57,57]
["BA5",null,3,25,25]
["BA5",null,3,57,57]
["BA5",null,3,80,80]
["CA1",null,3,16,16]
["CA1",null,3,23,23]
["CA1",null,3,28,28]
["CA1",null,3,36,36]
["CA2",null,3,2,2]
["CA2",null,3,31,31]
["CA2",null,3,48,48]
["CA2",null,3,64,64]
["CA2",null,3,73,73]
["CA2",null,3,85,85]
["CA3",null,3,10,10]
["CA3",null,3,20,20]
["CA3",null,3,24,24]
["CA3",null,3,46,46]
["CA3",null,3,49,49]
["CA3",null,3,57,57]
["CA3",null,3,58,58]
["CA3",null,3,79,79]
["CA3",null,3,84,84]
["CA3",null,3,90,90]
["CA4",null,3,50,50]
["CA4",null,3,61,61]
["CA4",null,3,78,78]
["CA5",null,3,21,21]
["CA5",null,3,27,27]
["FI1",null,3,23,23]
["FI1",null,3,36,36]
["FI1",null,3,39,39]
["FI1",null,3,54,54]
["FI2",null,3,22,22]
["FI2",null,3,27,27]
["FI2",null,3,33,33]
["FI2",null,3,54,54]
["FI2",null,3,81,81]
["FI2",null,3,82,82]
["FI3",null,3,21,21]
["FI3",null,3,51,51]
["FI3",null,3,63,63]
["FI3",null,3,72,72]
["FI3",null,3,87,87]
["FI3",null,3,88,88]
["FI4",null,3,16,16]
["FI4",null,3,18,18]
["FI5",null,3,15,15]
["FI5",null,3,39,39]
["FI5",null,3,43,43]
["FI5",null,3,46,46]
["FI5",null,3,67,67]
["FI5",null,3,68,68]
["GE1",null,3,21,21]
["GE1",null,3,59,59]
["GE1",null,3,75,75]
["GE2",null,3,14,14]
["GE2",null,3,63,63]
["GE2",null,3,88,88]
["GE3",null,3,6,6]
["GE3",null,3,10,{"$f":"IF(MOD(B194+D194,90),MOD(B194+D194,90),90)","v":10}]
["GE3",null,3,25,25]
["GE3",null,3,44,44]
["GE3",null,3,46,46]
["GE3",null,3,51,51]
["GE4",null,3,2,2]
["GE4",null,3,8,8]
["GE4",null,3,42,42]
["GE4",null,3,45,45]
["GE4",null,3,73,73]
["GE4",null,3,82,82]
["GE5",null,3,15,15]
["GE5",null,3,19,19]
["GE5",null,3,34,34]
["GE5",null,3,38,38]
["GE5",null,3,88,88]
["MI1",null,3,19,19]
["MI1",null,3,65,65]
["MI1",null,3,69,69]
["MI2",null,3,49,49]
["MI3",null,3,16,16]
["MI3",null,3,18,18]
["MI3",null,3,34,34]
["MI3",null,3,35,35]
["MI3",null,3,50,50]
["MI3",null,3,64,64]
["MI4",null,3,42,42]
["MI4",null,3,53,53]
["MI4",null,3,58,58]
["MI4",null,3,62,62]
["MI4",null,3,65,65]
["MI4",null,3,74,74]
["MI4",null,3,75,75]
["MI5",null,3,14,14]
["MI5",null,3,23,23]
["MI5",null,3,27,27]
["MI5",null,3,61,61]
["MI5",null,3,64,64]
["MI5",null,3,65,65]
["MI5",null,3,81,81]
["NA1",null,3,31,31]
["NA2",null,3,10,10]
["NA2",null,3,35,35]
["NA3",null,3,11,11]
["NA3",null,3,25,25]
["NA3",null,3,42,42]
["NA3",null,3,48,48]
["NA4",null,3,22,22]
["NA4",null,3,68,68]
["NA4",null,3,82,82]
["NA4",null,3,89,89]
["NA5",null,3,5,5]
["NA5",null,3,40,40]
["NA5",null,3,64,64]
["NA5",null,3,68,68]
["PA1",null,3,6,6]
["PA1",null,3,28,28]
["PA1",null,3,43,43]
["PA1",null,3,54,54]
["PA1",null,3,57,57]
["PA1",null,3,58,58]
["PA1",null,3,69,69]
["PA1",null,3,78,78]
["PA2",null,3,41,41]
["PA2",null,3,74,{"$f":"IF(MOD(B258+D258,90),MOD(B258+D258,90),90)","v":74}]
["PA2",null,3,76,76]
["PA3",null,3,35,35]
["PA3",null,3,36,36]
["PA3",null,3,48,48]
["PA3",null,3,54,54]
["PA3",null,3,79,79]
["PA4",null,3,1,1]
["PA4",null,3,6,6]
["PA4",null,3,32,32]
["PA4",null,3,70,70]
["PA4",null,3,71,71]
["PA5",null,3,55,55]
["PA5",null,3,58,58]
["PA5",null,3,59,59]
["RO1",null,3,34,34]
["RO2",null,3,47,47]
["RO2",null,3,56,56]
["RO2",null,3,59,59]
["RO2",null,3,66,66]
["RO2",null,3,87,87]
["RO3",null,3,4,4]
["RO3",null,3,17,17]
["RO3",null,3,23,23]
["RO3",null,3,33,33]
["RO3",null,3,66,66]
["RO3",null,3,79,79]
["RO4",null,3,12,12]
["RO4",null,3,18,18]
["RO5",null,3,17,17]
["RO5",null,3,33,33]
["RO5",null,3,61,61]
["TO1",null,3,44,44]
["TO2",null,3,15,15]
["TO2",null,3,36,36]
["TO2",null,3,37,37]
["TO2",null,3,54,54]
["TO2",null,3,57,57]
["TO2",null,3,75,75]
["TO2",null,3,83,83]
["TO3",null,3,30,30]
["TO3",null,3,31,31]
["TO3",null,3,46,46]
["TO4",null,3,67,67]
["TO4",null,3,73,73]
["TO5",null,3,20,20]
["TO5",null,3,33,33]
["TO5",null,3,49,49]
["VE1",null,3,13,13]
["VE1",null,3,24,24]
["VE1",null,3,63,63]
["VE1",null,3,64,64]
["VE1",null,3,67,67]
["VE2",null,3,9,9]
["VE2",null,3,26,26]
["VE2",null,3,39,39]
["VE2",null,3,54,54]
["VE2",null,3,63,63]
["VE2",null,3,65,65]
["VE2",null,3,78,78]
["VE3",null,3,31,31]
["VE3",null,3,54,54]
["VE3",null,3,84,84]
["VE3",null,3,86,86]
["VE4",null,3,15,{"$f":"IF(MOD(B322+D322,90),MOD(B322+D322,90),90)","v":15}]
["VE4",null,3,17,17]
["VE4",null,3,25,25]
["VE4",null,3,52,52]
["VE4",null,3,81,81]
["VE5",null,3,54,54]
["VE5",null,3,78,78]
["VE5",null,3,90,90]
["NZ1",null,3,20,20]
["NZ1",null,3,21,21]
["NZ1",null,3,32,32]
["NZ2",null,3,27,27]
["NZ2",null,3,31,31]
["NZ2",null,3,35,35]
["NZ2",null,3,56,56]
["NZ2",null,3,62,62]
["NZ2",null,3,79,79]
["NZ3",null,3,23,23]
["NZ3",null,3,66,66]
["NZ3",null,3,89,89]
["NZ4",null,3,19,19]
["NZ4",null,3,41,41]
["NZ4",null,3,45,45]
["NZ4",null,3,57,57]
["NZ4",null,3,75,75]
["NZ4",null,3,78,78]
["NZ4",null,3,80,80]
["NZ5",null,3,16,16]
["NZ5",null,3,22,22]
["NZ5",null,3,32,32]
["BA1",null,4,3,3]
["BA1",null,4,26,26]
["BA1",null,4,30,30]
["BA1",null,4,63,63]
["BA1",null,4,65,65]
["BA1",null,4,70,70]
["BA1",null,4,73,73]
["BA1",null,4,76,76]
["BA1",null,4,83,83]
["BA1",null,4,86,86]
["BA1",null,4,88,88]
["BA2",null,4,6,6]
["BA2",null,4,9,9]
["BA2",null,4,20,20]
["BA2",null,4,24,24]
["BA2",null,4,25,25]
["BA2",null,4,52,52]
["BA2",null,4,76,76]
["BA3",null,4,13,13]
["BA3",null,4,14,14]
["BA3",null,4,18,18]
["BA3",null,4,47,47]
["BA3",null,4,69,69]
["BA3",null,4,71,71]
["BA3",null,4,73,73]
["BA3",null,4,88,88]
["BA3",null,4,90,90]
["BA4",null,4,9,9]
["BA4",null,4,20,20]
["BA4",null,4,34,34]
["BA4",null,4,40,40]
["BA4",null,4,54,54]
["BA4",null,4,60,60]
["BA4",null,4,67,67]
["BA4",null,4,68,{"$f":"IF(MOD(B386+D386,90),MOD(B386+D386,90),90)","v":68}]
["BA4",null,4,87,87]
["BA5",null,4,17,17]
["BA5",null,4,26,26]
["BA5",null,4,29,29]
["BA5",null,4,58,58]
["BA5",null,4,67,67]
["BA5",null,4,79,79]
["BA5",null,4,81,81]
["BA5",null,4,89,89]
["CA1",null,4,1,1]
["CA1",null,4,17,17]
["CA1",null,4,24,24]
["CA1",null,4,35,35]
["CA1",null,4,50,50]
["CA1",null,4,61,61]
["CA1",null,4,63,63]
["CA1",null,4,69,69]
["CA1",null,4,79,79]
["CA2",null,4,4,4]
["CA2",null,4,10,10]
["CA2",null,4,14,14]
["CA2",null,4,57,57]
["CA2",null,4,60,60]
["CA2",null,4,65,65]
["CA2",null,4,77,77]
["CA2",null,4,79,79]
["CA3",null,4,3,3]
["CA3",null,4,12,12]
["CA3",null,4,15,15]
["CA3",null,4,43,43]
["CA3",null,4,54,54]
["CA3",null,4,64,64]
["CA3",null,4,65,65]
["CA3",null,4,68,68]
["CA3",null,4,71,71]
["CA4",null,4,5,5]
["CA4",null,4,9,9]
["CA4",null,4,16,16]
["CA4",null,4,35,35]
["CA4",null,4,52,52]
["CA4",null,4,84,84]
["CA4",null,4,86,86]
["CA4",null,4,90,90]
["CA5",null,4,8,8]
["CA5",null,4,15,15]
["CA5",null,4,34,34]
["CA5",null,4,37,37]
["CA5",null,4,50,50]
["CA5",null,4,58,58]
["CA5",null,4,59,59]
["CA5",null,4,67,67]
["CA5",null,4,85,85]
["FI1",null,4,2,2]
["FI1",null,4,27,27]
["FI1",null,4,40,40]
["FI1",null,4,58,58]
["FI1",null,4,66,66]
["FI1",null,4,77,77]
["FI1",null,4,78,78]
["FI1",null,4,82,82]
["FI2",null,4,1,1]
["FI2",null,4,13,13]
["FI2",null,4,26,26]
["FI2",null,4,41,{"$f":"IF(MOD(B450+D450,90),MOD(B450+D450,90),90)","v":41}]
["FI2",null,4,47,47]
["FI2",null,4,51,51]
["FI2",null,4,53,53]
["FI2",null,4,63,63]
["FI2",null,4,73,73]
["FI2",null,4,90,90]
["FI3",null,4,17,17]
["FI3",null,4,19,19]
["FI3",null,4,25,25]
["FI3",null,4,27,27]
["FI3",null,4,30,30]
["FI3",null,4,39,39]
["FI3",null,4,52,52]
["FI3",null,4,90,90]
["FI4",null,4,8,8]
["FI4",null,4,9,9]
["FI4",null,4,11,11]
["FI4",null,4,12,12]
["FI4",null,4,17,17]
["FI4",null,4,25,25]
["FI4",null,4,50,50]
["FI4",null,4,62,62]
["FI4",null,4,68,68]
["FI4",null,4,82,82]
["FI5",null,4,4,4]
["FI5",null,4,9,9]
["FI5",null,4,10,10]
["FI5",null,4,33,33]
["FI5",null,4,40,40]
["FI5",null,4,51,51]
["FI5",null,4,53,53]
["FI5",null,4,59,59]
["FI5",null,4,61,61]
["GE1",null,4,25,25]
["GE1",null,4,36,36]
["GE1",null,4,39,39]
["GE1",null,4,72,72]
["GE1",null,4,86,86]
["GE2",null,4,6,6]
["GE2",null,4,12,12]
["GE2",null,4,13,13]
["GE2",null,4,48,48]
["GE2",null,4,65,65]
["GE2",null,4,67,67]
["GE3",null,4,3,3]
["GE3",null,4,43,43]
["GE3",null,4,64,64]
["GE3",null,4,74,74]
["GE3",null,4,80,80]
["GE3",null,4,84,84]
["GE3",null,4,85,85]
["GE4",null,4,4,4]
["GE4",null,4,14,14]
["GE4",null,4,18,18]
["GE4",null,4,44,44]
["GE4",null,4,53,53]
["GE4",null,4,57,57]
["GE4",null,4,61,61]
["GE4",null,4,67,67]
["GE4",null,4,81,81]
["GE4",null,4,90,90]
["GE5",null,4,27,27]
["GE5",null,4,43,43]
["GE5",null,4,70,{"$f":"IF(MOD(B514+D514,90),MOD(B514+D514,90),90)","v":70}]
["GE5",null,4,72,72]
["MI1",null,4,5,5]
["MI1",null,4,15,15]
["MI1",null,4,26,26]
["MI1",null,4,52,52]
["MI1",null,4,67,67]
["MI1",null,4,77,77]
["MI2",null,4,28,28]
["MI2",null,4,51,51]
["MI2",null,4,65,65]
["MI2",null,4,67,67]
["MI2",null,4,72,72]
["MI2",null,4,76,76]
["MI3",null,4,19,19]
["MI3",null,4,37,37]
["MI3",null,4,47,47]
["MI3",null,4,51,51]
["MI3",null,4,73,73]
["MI4",null,4,3,3]
["MI4",null,4,10,10]
["MI4",null,4,15,15]
["MI4",null,4,17,17]
["MI4",null,4,26,26]
["MI4",null,4,46,46]
["MI4",null,4,50,50]
["MI4",null,4,54,54]
["MI4",null,4,56,56]
["MI5",null,4,34,34]
["MI5",null,4,35,35]
["MI5",null,4,42,42]
["MI5",null,4,46,46]
["MI5",null,4,60,60]
["NA1",null,4,1,1]
["NA1",null,4,8,8]
["NA1",null,4,17,17]
["NA1",null,4,37,37]
["NA1",null,4,43,43]
["NA1",null,4,67,67]
["NA1",null,4,71,71]
["NA1",null,4,77,77]
["NA1",null,4,78,78]
["NA2",null,4,5,5]
["NA2",null,4,23,23]
["NA2",null,4,39,39]
["NA2",null,4,41,41]
["NA2",null,4,42,42]
["NA2",null,4,47,47]
["NA2",null,4,68,68]
["NA2",null,4,71,71]
["NA2",null,4,79,79]
["NA3",null,4,2,2]
["NA3",null,4,6,6]
["NA3",null,4,17,17]
["NA3",null,4,45,45]
["NA3",null,4,51,51]
["NA3",null,4,77,77]
["NA3",null,4,86,86]
["NA4",null,4,1,1]
["NA4",null,4,2,2]
["NA4",null,4,3,3]
["NA4",null,4,11,11]
["NA4",null,4,17,17]
["NA4",null,4,60,60]
["NA4",null,4,64,{"$f":"IF(MOD(B578+D578,90),MOD(B578+D578,90),90)","v":64}]
["NA5",null,4,4,4]
["NA5",null,4,24,24]
["NA5",null,4,61,61]
["NA5",null,4,66,66]
["NA5",null,4,72,72]
["NA5",null,4,73,73]
["NA5",null,4,80,80]
["NA5",null,4,88,88]
["PA1",null,4,8,8]
["PA1",null,4,9,9]
["PA1",null,4,10,10]
["PA1",null,4,12,12]
["PA1",null,4,39,39]
["PA1",null,4,51,51]
["PA1",null,4,70,70]
["PA1",null,4,75,75]
["PA1",null,4,89,89]
["PA2",null,4,5,5]
["PA2",null,4,9,9]
["PA2",null,4,20,20]
["PA2",null,4,23,23]
["PA2",null,4,30,30]
["PA2",null,4,43,43]
["PA2",null,4,44,44]
["PA2",null,4,62,62]
["PA2",null,4,71,71]
["PA2",null,4,80,80]
["PA2",null,4,84,84]
["PA3",null,4,15,15]
["PA3",null,4,41,41]
["PA3",null,4,42,42]
["PA3",null,4,45,45]
["PA3",null,4,66,66]
["PA3",null,4,80,80]
["PA4",null,4,2,2]
["PA4",null,4,12,12]
["PA4",null,4,19,19]
["PA4",null,4,27,27]
["PA4",null,4,35,35]
["PA4",null,4,55,55]
["PA4",null,4,59,59]
["PA4",null,4,62,62]
["PA4",null,4,74,74]
["PA4",null,4,76,76]
["PA4",null,4,78,78]
["PA4",null,4,79,79]
["PA4",null,4,83,83]
["PA4",null,4,90,90]
["PA5",null,4,4,4]
["PA5",null,4,5,5]
["PA5",null,4,7,7]
["PA5",null,4,19,19]
["PA5",null,4,37,37]
["PA5",null,4,38,38]
["PA5",null,4,54,54]
["PA5",null,4,69,69]
["PA5",null,4,73,73]
["PA5",null,4,80,80]
["PA5",null,4,86,86]
["RO1",null,4,1,1]
["RO1",null,4,23,23]
["RO1",null,4,32,32]
["RO1",null,4,37,37]
["RO1",null,4,47,{"$f":"IF(MOD(B642+D642,90),MOD(B642+D642,90),90)","v":47}]
["RO1",null,4,48,48]
["RO1",null,4,50,50]
["RO1",null,4,57,57]
["RO1",null,4,75,75]
["RO2",null,4,12,12]
["RO2",null,4,14,14]
["RO2",null,4,15,15]
["RO2",null,4,22,22]
["RO2",null,4,27,27]
["RO2",null,4,76,76]
["RO3",null,4,8,8]
["RO3",null,4,20,20]
["RO3",null,4,25,25]
["RO3",null,4,34,34]
["RO3",null,4,37,37]
["RO3",null,4,55,55]
["RO3",null,4,56,56]
["RO3",null,4,58,58]
["RO3",null,4,60,60]
["RO3",null,4,63,63]
["RO3",null,4,68,68]
["RO3",null,4,72,72]
["RO3",null,4,87,87]
["RO4",null,4,32,32]
["RO4",null,4,37,37]
["RO4",null,4,40,40]
["RO4",null,4,47,47]
["RO4",null,4,84,84]
["RO5",null,4,37,37]
["RO5",null,4,53,53]
["RO5",null,4,54,54]
["RO5",null,4,70,70]
["RO5",null,4,75,75]
["RO5",null,4,90,90]
["TO1",null,4,6,6]
["TO1",null,4,18,18]
["TO1",null,4,19,19]
["TO1",null,4,23,23]
["TO1",null,4,43,43]
["TO1",null,4,48,48]
["TO1",null,4,49,49]
["TO1",null,4,63,63]
["TO1",null,4,80,80]
["TO2",null,4,13,13]
["TO2",null,4,18,18]
["TO2",null,4,23,23]
["TO2",null,4,32,32]
["TO2",null,4,42,42]
["TO2",null,4,43,43]
["TO2",null,4,58,58]
["TO2",null,4,60,60]
["TO2",null,4,64,64]
["TO2",null,4,68,68]
["TO3",null,4,20,20]
["TO3",null,4,21,21]
["TO3",null,4,23,23]
["TO3",null,4,56,56]
["TO4",null,4,4,4]
["TO4",null,4,12,12]
["TO4",null,4,24,24]
["TO4",null,4,40,40]
["TO4",null,4,41,41]
["TO4",null,4,52,52]
["TO4",null,4,57,{"$f":"IF(MOD(B706+D706,90),MOD(B706+D706,90),90)","v":57}]
["TO4",null,4,63,63]
["TO4",null,4,69,69]
["TO4",null,4,70,70]
["TO5",null,4,10,10]
["TO5",null,4,23,23]
["TO5",null,4,30,30]
["TO5",null,4,31,31]
["TO5",null,4,41,41]
["TO5",null,4,58,58]
["TO5",null,4,69,69]
["TO5",null,4,74,74]
["TO5",null,4,87,87]
["VE1",null,4,9,9]
["VE1",null,4,14,14]
["VE1",null,4,33,33]
["VE1",null,4,47,47]
["VE1",null,4,50,50]
["VE1",null,4,72,72]
["VE1",null,4,84,84]
["VE2",null,4,11,11]
["VE2",null,4,41,41]
["VE2",null,4,60,60]
["VE2",null,4,83,83]
["VE2",null,4,89,89]
["VE3",null,4,12,12]
["VE3",null,4,41,41]
["VE3",null,4,44,44]
["VE3",null,4,51,51]
["VE3",null,4,55,55]
["VE3",null,4,72,72]
["VE4",null,4,2,2]
["VE4",null,4,30,30]
["VE4",null,4,82,82]
["VE4",null,4,83,83]
["VE4",null,4,85,85]
["VE5",null,4,5,5]
["VE5",null,4,22,22]
["VE5",null,4,33,33]
["VE5",null,4,37,37]
["VE5",null,4,52,52]
["VE5",null,4,58,58]
["VE5",null,4,68,68]
["VE5",null,4,74,74]
["NZ1",null,4,10,10]
["NZ1",null,4,11,11]
["NZ1",null,4,28,28]
["NZ1",null,4,35,35]
["NZ1",null,4,55,55]
["NZ1",null,4,66,66]
["NZ1",null,4,71,71]
["NZ1",null,4,80,80]
["NZ1",null,4,83,83]
["NZ1",null,4,84,84]
["NZ1",null,4,88,88]
["NZ2",null,4,3,3]
["NZ2",null,4,4,4]
["NZ2",null,4,11,11]
["NZ2",null,4,18,18]
["NZ2",null,4,23,23]
["NZ2",null,4,40,40]
["NZ2",null,4,88,88]
["NZ3",null,4,5,5]
["NZ3",null,4,7,7]
["NZ3",null,4,18,{"$f":"IF(MOD(B770+D770,90),MOD(B770+D770,90),90)","v":18}]
["NZ3",null,4,32,32]
["NZ3",null,4,69,69]
["NZ4",null,4,6,6]
["NZ4",null,4,71,71]
["NZ4",null,4,82,82]
["NZ5",null,4,5,5]
["NZ5",null,4,30,30]
["NZ5",null,4,44,44]
["NZ5",null,4,49,49]
["NZ5",null,4,63,63]
["NZ5",null,4,64,64]
["NZ5",null,4,69,69]
["NZ5",null,4,74,74]
["NZ5",null,4,78,78]
["BA1",null,5,1,1]
["BA1",null,5,5,5]
["BA1",null,5,15,15]
["BA1",null,5,18,18]
["BA1",null,5,22,22]
["BA1",null,5,25,25]
["BA1",null,5,32,32]
["BA1",null,5,51,51]
["BA1",null,5,52,52]
["BA2",null,5,13,13]
["BA2",null,5,31,31]
["BA2",null,5,34,34]
["BA2",null,5,41,41]
["BA2",null,5,43,43]
["BA2",null,5,80,80]
["BA2",null,5,87,87]
["BA2",null,5,88,88]
["BA3",null,5,8,8]
["BA3",null,5,26,26]
["BA3",null,5,34,34]
["BA3",null,5,50,50]
["BA3",null,5,53,53]
["BA3",null,5,60,60]
["BA3",null,5,63,63]
["BA3",null,5,64,64]
["BA3",null,5,84,84]
["BA4",null,5,26,26]
["BA4",null,5,32,32]
["BA4",null,5,41,41]
["BA4",null,5,55,55]
["BA4",null,5,62,62]
["BA5",null,5,34,34]
["BA5",null,5,44,44]
["BA5",null,5,47,47]
["BA5",null,5,49,49]
["BA5",null,5,51,51]
["BA5",null,5,64,64]
["BA5",null,5,65,65]
["BA5",null,5,69,69]
["BA5",null,5,74,74]
["BA5",null,5,77,77]
["BA5",null,5,90,90]
["CA1",null,5,7,7]
["CA1",null,5,22,22]
["CA1",null,5,30,30]
["CA1",null,5,34,34]
["CA1",null,5,37,37]
["CA1",null,5,45,45]
["CA1",null,5,67,67]
["CA1",null,5,68,{"$f":"IF(MOD(B834+D834,90),MOD(B834+D834,90),90)","v":68}]
["CA1",null,5,73,73]
["CA1",null,5,78,78]
["CA1",null,5,81,81]
["CA1",null,5,87,87]
["CA2",null,5,7,7]
["CA2",null,5,9,9]
["CA2",null,5,11,11]
["CA2",null,5,33,33]
["CA2",null,5,35,35]
["CA2",null,5,49,49]
["CA2",null,5,56,56]
["CA2",null,5,61,61]
["CA2",null,5,76,76]
["CA3",null,5,4,4]
["CA3",null,5,5,5]
["CA3",null,5,30,30]
["CA3",null,5,35,35]
["CA3",null,5,60,60]
["CA3",null,5,74,74]
["CA3",null,5,80,80]
["CA4",null,5,8,8]
["CA4",null,5,12,12]
["CA4",null,5,28,28]
["CA4",null,5,38,38]
["CA4",null,5,44,44]
["CA4",null,5,46,46]
["CA4",null,5,59,59]
["CA4",null,5,63,63]
["CA4",null,5,67,67]
["CA4",null,5,70,70]
["CA4",null,5,75,75]
["CA4",null,5,79,79]
["CA5",null,5,7,7]
["CA5",null,5,14,14]
["CA5",null,5,19,19]
["CA5",null,5,28,28]
["CA5",null,5,32,32]
["CA5",null,5,40,40]
["CA5",null,5,44,44]
["CA5",null,5,48,48]
["CA5",null,5,51,51]
["CA5",null,5,66,66]
["CA5",null,5,75,75]
["CA5",null,5,77,77]
["FI1",null,5,21,21]
["FI1",null,5,24,24]
["FI1",null,5,50,50]
["FI1",null,5,53,53]
["FI1",null,5,62,62]
["FI1",null,5,67,67]
["FI1",null,5,84,84]
["FI1",null,5,85,85]
["FI2",null,5,3,3]
["FI2",null,5,12,12]
["FI2",null,5,16,16]
["FI2",null,5,32,32]
["FI2",null,5,35,35]
["FI2",null,5,38,38]
["FI2",null,5,71,71]
["FI2",null,5,88,88]
["FI2",null,5,89,89]
["FI3",null,5,5,5]
["FI3",null,5,8,8]
["FI3",null,5,9,{"$f":"IF(MOD(B898+D898,90),MOD(B898+D898,90),90)","v":9}]
["FI3",null,5,12,12]
["FI3",null,5,18,18]
["FI3",null,5,26,26]
["FI3",null,5,28,28]
["FI3",null,5,29,29]
["FI3",null,5,32,32]
["FI3",null,5,42,42]
["FI3",null,5,45,45]
["FI3",null,5,61,61]
["FI4",null,5,3,3]
["FI4",null,5,5,5]
["FI4",null,5,15,15]
["FI4",null,5,24,24]
["FI4",null,5,27,27]
["FI4",null,5,28,28]
["FI4",null,5,32,32]
["FI4",null,5,63,63]
["FI4",null,5,71,71]
["FI4",null,5,90,90]
["FI5",null,5,3,3]
["FI5",null,5,48,48]
["FI5",null,5,52,52]
["FI5",null,5,70,70]
["FI5",null,5,76,76]
["FI5",null,5,81,81]
["GE1",null,5,20,20]
["GE1",null,5,24,24]
["GE1",null,5,29,29]
["GE1",null,5,31,31]
["GE1",null,5,32,32]
["GE1",null,5,41,41]
["GE1",null,5,61,61]
["GE1",null,5,63,63]
["GE1",null,5,64,64]
["GE1",null,5,67,67]
["GE1",null,5,73,73]
["GE1",null,5,84,84]
["GE1",null,5,87,87]
["GE1",null,5,88,88]
["GE2",null,5,3,3]
["GE2",null,5,4,4]
["GE2",null,5,16,16]
["GE2",null,5,17,17]
["GE2",null,5,29,29]
["GE2",null,5,32,32]
["GE2",null,5,34,34]
["GE2",null,5,50,50]
["GE2",null,5,51,51]
["GE2",null,5,52,52]
["GE2",null,5,56,56]
["GE2",null,5,69,69]
["GE2",null,5,70,70]
["GE2",null,5,76,76]
["GE2",null,5,80,80]
["GE3",null,5,5,5]
["GE3",null,5,9,9]
["GE3",null,5,12,12]
["GE3",null,5,15,15]
["GE3",null,5,23,23]
["GE3",null,5,30,30]
["GE3",null,5,36,36]
["GE3",null,5,39,39]
["GE3",null,5,40,40]
["GE3",null,5,42,{"$f":"IF(MOD(B962+D962,90),MOD(B962+D962,90),90)","v":42}]
["GE3",null,5,49,49]
["GE3",null,5,68,68]
["GE3",null,5,79,79]
["GE4",null,5,1,1]
["GE4",null,5,24,24]
["GE4",null,5,28,28]
["GE4",null,5,32,32]
["GE4",null,5,59,59]
["GE4",null,5,62,62]
["GE4",null,5,68,68]
["GE4",null,5,72,72]
["GE4",null,5,83,83]
["GE4",null,5,88,88]
["GE4",null,5,89,89]
["GE5",null,5,11,11]
["GE5",null,5,13,13]
["GE5",null,5,20,20]
["GE5",null,5,28,28]
["GE5",null,5,44,44]
["GE5",null,5,49,49]
["GE5",null,5,52,52]
["GE5",null,5,57,57]
["GE5",null,5,65,65]
["GE5",null,5,69,69]
["GE5",null,5,74,74]
["GE5",null,5,83,83]
["GE5",null,5,85,85]
["GE5",null,5,89,89]
["MI1",null,5,13,13]
["MI1",null,5,18,18]
["MI1",null,5,28,28]
["MI1",null,5,37,37]
["MI1",null,5,41,41]
["MI1",null,5,47,47]
["MI1",null,5,53,53]
["MI1",null,5,54,54]
["MI1",null,5,57,57]
["MI1",null,5,74,74]
["MI1",null,5,82,82]
["MI2",null,5,6,6]
["MI2",null,5,12,12]
["MI2",null,5,17,17]
["MI2",null,5,22,22]
["MI2",null,5,31,31]
["MI2",null,5,32,32]
["MI2",null,5,34,34]
["MI2",null,5,39,39]
["MI2",null,5,42,42]
["MI2",null,5,56,56]
["MI2",null,5,78,78]
["MI2",null,5,81,81]
["MI2",null,5,82,82]
["MI3",null,5,3,3]
["MI3",null,5,4,4]
["MI3",null,5,20,20]
["MI3",null,5,22,22]
["MI3",null,5,29,29]
["MI3",null,5,30,30]
["MI3",null,5,32,32]
["MI3",null,5,48,48]
["MI3",null,5,68,68]
["MI3",null,5,71,71]
["MI3",null,5,76,76]
["MI3",null,5,79,{"$f":"IF(MOD(B1026+D1026,90),MOD(B1026+D1026,90),90)","v":79}]
["MI3",null,5,87,87]
["MI4",null,5,18,18]
["MI4",null,5,35,35]
["MI4",null,5,44,44]
["MI4",null,5,68,68]
["MI4",null,5,71,71]
["MI4",null,5,73,73]
["MI4",null,5,83,83]
["MI5",null,5,8,8]
["MI5",null,5,13,13]
["MI5",null,5,21,21]
["MI5",null,5,36,36]
["MI5",null,5,37,37]
["MI5",null,5,44,44]
["MI5",null,5,47,47]
["MI5",null,5,56,56]
["MI5",null,5,63,63]
["MI5",null,5,71,71]
["MI5",null,5,73,73]
["NA1",null,5,10,10]
["NA1",null,5,14,14]
["NA1",null,5,19,19]
["NA1",null,5,20,20]
["NA1",null,5,26,26]
["NA1",null,5,32,32]
["NA1",null,5,34,34]
["NA1",null,5,44,44]
["NA1",null,5,47,47]
["NA1",null,5,51,51]
["NA1",null,5,55,55]
["NA1",null,5,57,57]
["NA1",null,5,64,64]
["NA1",null,5,89,89]
["NA2",null,5,3,3]
["NA2",null,5,21,21]
["NA2",null,5,31,31]
["NA2",null,5,34,34]
["NA2",null,5,40,40]
["NA2",null,5,43,43]
["NA2",null,5,46,46]
["NA2",null,5,48,48]
["NA2",null,5,60,60]
["NA2",null,5,65,65]
["NA2",null,5,75,75]
["NA2",null,5,80,80]
["NA2",null,5,81,81]
["NA2",null,5,82,82]
["NA3",null,5,4,4]
["NA3",null,5,7,7]
["NA3",null,5,27,27]
["NA3",null,5,31,31]
["NA3",null,5,39,39]
["NA3",null,5,63,63]
["NA3",null,5,85,85]
["NA4",null,5,12,12]
["NA4",null,5,15,15]
["NA4",null,5,16,16]
["NA4",null,5,24,24]
["NA4",null,5,37,37]
["NA4",null,5,43,43]
["NA4",null,5,49,49]
["NA4",null,5,53,53]
["NA4",null,5,61,61]
["NA4",null,5,62,{"$f":"IF(MOD(B1090+D1090,90),MOD(B1090+D1090,90),90)","v":62}]
["NA4",null,5,73,73]
["NA4",null,5,87,87]
["NA4",null,5,88,88]
["NA5",null,5,13,13]
["NA5",null,5,30,30]
["NA5",null,5,33,33]
["NA5",null,5,45,45]
["NA5",null,5,50,50]
["NA5",null,5,58,58]
["NA5",null,5,76,76]
["NA5",null,5,79,79]
["NA5",null,5,86,86]
["PA1",null,5,26,26]
["PA1",null,5,44,44]
["PA1",null,5,59,59]
["PA1",null,5,60,60]
["PA1",null,5,65,65]
["PA1",null,5,82,82]
["PA1",null,5,87,87]
["PA2",null,5,16,16]
["PA2",null,5,17,17]
["PA2",null,5,33,33]
["PA2",null,5,35,35]
["PA2",null,5,36,36]
["PA2",null,5,53,53]
["PA2",null,5,57,57]
["PA2",null,5,60,60]
["PA2",null,5,67,67]
["PA2",null,5,73,73]
["PA3",null,5,2,2]
["PA3",null,5,10,10]
["PA3",null,5,13,13]
["PA3",null,5,19,19]
["PA3",null,5,28,28]
["PA3",null,5,51,51]
["PA3",null,5,55,55]
["PA3",null,5,60,60]
["PA3",null,5,61,61]
["PA3",null,5,69,69]
["PA3",null,5,86,86]
["PA3",null,5,90,90]
["PA4",null,5,7,7]
["PA4",null,5,21,21]
["PA4",null,5,36,36]
["PA4",null,5,40,40]
["PA4",null,5,48,48]
["PA4",null,5,51,51]
["PA4",null,5,57,57]
["PA4",null,5,64,64]
["PA5",null,5,2,2]
["PA5",null,5,3,3]
["PA5",null,5,9,9]
["PA5",null,5,10,10]
["PA5",null,5,13,13]
["PA5",null,5,18,18]
["PA5",null,5,22,22]
["PA5",null,5,30,30]
["PA5",null,5,42,42]
["PA5",null,5,44,44]
["PA5",null,5,48,48]
["PA5",null,5,50,50]
["PA5",null,5,64,64]
["PA5",null,5,87,87]
["PA5",null,5,89,{"$f":"IF(MOD(B1154+D1154,90),MOD(B1154+D1154,90),90)","v":89}]
["RO1",null,5,6,6]
["RO1",null,5,8,8]
["RO1",null,5,9,9]
["RO1",null,5,21,21]
["RO1",null,5,30,30]
["RO1",null,5,41,41]
["RO1",null,5,55,55]
["RO1",null,5,61,61]
["RO1",null,5,69,69]
["RO1",null,5,71,71]
["RO1",null,5,73,73]
["RO1",null,5,84,84]
["RO2",null,5,7,7]
["RO2",null,5,10,10]
["RO2",null,5,13,13]
["RO2",null,5,18,18]
["RO2",null,5,20,20]
["RO2",null,5,31,31]
["RO2",null,5,39,39]
["RO2",null,5,45,45]
["RO2",null,5,54,54]
["RO2",null,5,57,57]
["RO2",null,5,83,83]
["RO2",null,5,90,90]
["RO3",null,5,7,7]
["RO3",null,5,10,10]
["RO3",null,5,18,18]
["RO3",null,5,22,22]
["RO3",null,5,24,24]
["RO3",null,5,26,26]
["RO3",null,5,27,27]
["RO3",null,5,30,30]
["RO3",null,5,40,40]
["RO3",null,5,62,62]
["RO3",null,5,65,65]
["RO3",null,5,77,77]
["RO3",null,5,78,78]
["RO4",null,5,16,16]
["RO4",null,5,19,19]
["RO4",null,5,34,34]
["RO4",null,5,56,56]
["RO4",null,5,58,58]
["RO4",null,5,62,62]
["RO4",null,5,66,66]
["RO4",null,5,71,71]
["RO4",null,5,76,76]
["RO5",null,5,13,13]
["RO5",null,5,21,21]
["RO5",null,5,28,28]
["RO5",null,5,30,30]
["RO5",null,5,35,35]
["RO5",null,5,39,39]
["RO5",null,5,59,59]
["RO5",null,5,62,62]
["RO5",null,5,63,63]
["RO5",null,5,67,67]
["RO5",null,5,84,84]
["TO1",null,5,22,22]
["TO1",null,5,25,25]
["TO1",null,5,26,26]
["TO1",null,5,28,28]
["TO1",null,5,42,42]
["TO1",null,5,57,57]
["TO1",null,5,65,{"$f":"IF(MOD(B1218+D1218,90),MOD(B1218+D1218,90),90)","v":65}]
["TO1",null,5,66,66]
["TO1",null,5,71,71]
["TO1",null,5,79,79]
["TO2",null,5,2,2]
["TO2",null,5,3,3]
["TO2",null,5,9,9]
["TO2",null,5,16,16]
["TO2",null,5,27,27]
["TO2",null,5,30,30]
["TO2",null,5,35,35]
["TO2",null,5,39,39]
["TO2",null,5,50,50]
["TO2",null,5,70,70]
["TO2",null,5,71,71]
["TO2",null,5,80,80]
["TO2",null,5,87,87]
["TO3",null,5,4,4]
["TO3",null,5,12,12]
["TO3",null,5,24,24]
["TO3",null,5,26,26]
["TO3",null,5,29,29]
["TO3",null,5,38,38]
["TO3",null,5,53,53]
["TO3",null,5,65,65]
["TO3",null,5,67,67]
["TO3",null,5,76,76]
["TO3",null,5,77,77]
["TO3",null,5,80,80]
["TO3",null,5,89,89]
["TO4",null,5,8,8]
["TO4",null,5,21,21]
["TO4",null,5,23,23]
["TO4",null,5,27,27]
["TO4",null,5,33,33]
["TO4",null,5,38,38]
["TO4",null,5,49,49]
["TO4",null,5,55,55]
["TO4",null,5,58,58]
["TO4",null,5,68,68]
["TO4",null,5,79,79]
["TO4",null,5,82,82]
["TO4",null,5,90,90]
["TO5",null,5,14,14]
["TO5",null,5,17,17]
["TO5",null,5,19,19]
["TO5",null,5,26,26]
["TO5",null,5,27,27]
["TO5",null,5,39,39]
["TO5",null,5,40,40]
["TO5",null,5,45,45]
["TO5",null,5,46,46]
["TO5",null,5,63,63]
["TO5",null,5,67,67]
["TO5",null,5,76,76]
["TO5",null,5,84,84]
["VE1",null,5,4,4]
["VE1",null,5,15,15]
["VE1",null,5,17,17]
["VE1",null,5,26,26]
["VE1",null,5,32,32]
["VE1",null,5,34,34]
["VE1",null,5,36,36]
["VE1",null,5,43,43]
["VE1",null,5,45,{"$f":"IF(MOD(B1282+D1282,90),MOD(B1282+D1282,90),90)","v":45}]
["VE1",null,5,68,68]
["VE1",null,5,85,85]
["VE1",null,5,86,86]
["VE1",null,5,89,89]
["VE2",null,5,2,2]
["VE2",null,5,3,3]
["VE2",null,5,4,4]
["VE2",null,5,5,5]
["VE2",null,5,10,10]
["VE2",null,5,15,15]
["VE2",null,5,31,31]
["VE2",null,5,32,32]
["VE2",null,5,79,79]
["VE3",null,5,14,14]
["VE3",null,5,33,33]
["VE3",null,5,48,48]
["VE3",null,5,70,70]
["VE3",null,5,75,75]
["VE3",null,5,77,77]
["VE3",null,5,83,83]
["VE3",null,5,88,88]
["VE4",null,5,21,21]
["VE4",null,5,24,24]
["VE4",null,5,26,26]
["VE4",null,5,27,27]
["VE4",null,5,29,29]
["VE4",null,5,31,31]
["VE4",null,5,41,41]
["VE4",null,5,55,55]
["VE4",null,5,61,61]
["VE4",null,5,63,63]
["VE4",null,5,64,64]
["VE4",null,5,74,74]
["VE4",null,5,75,75]
["VE5",null,5,7,7]
["VE5",null,5,21,21]
["VE5",null,5,24,24]
["VE5",null,5,32,32]
["VE5",null,5,41,41]
["VE5",null,5,46,46]
["VE5",null,5,57,57]
["VE5",null,5,61,61]
["VE5",null,5,66,66]
["VE5",null,5,71,71]
["VE5",null,5,86,86]
["VE5",null,5,88,88]
["NZ1",null,5,13,13]
["NZ1",null,5,16,16]
["NZ1",null,5,30,30]
["NZ1",null,5,31,31]
["NZ1",null,5,47,47]
["NZ1",null,5,58,58]
["NZ1",null,5,64,64]
["NZ1",null,5,69,69]
["NZ1",null,5,78,78]
["NZ1",null,5,87,87]
["NZ2",null,5,9,9]
["NZ2",null,5,15,15]
["NZ2",null,5,26,26]
["NZ2",null,5,28,28]
["NZ2",null,5,37,37]
["NZ2",null,5,42,42]
["NZ2",null,5,59,59]
["NZ2",null,5,90,{"$f":"IF(MOD(B1346+D1346,90),MOD(B1346+D1346,90),90)","v":90}]
["NZ3",null,5,2,2]
["NZ3",null,5,8,8]
["NZ3",null,5,10,10]
["NZ3",null,5,13,13]
["NZ3",null,5,16,16]
["NZ3",null,5,20,20]
["NZ3",null,5,22,22]
["NZ3",null,5,25,25]
["NZ3",null,5,33,33]
["NZ3",null,5,50,50]
["NZ3",null,5,51,51]
["NZ3",null,5,61,61]
["NZ3",null,5,64,64]
["NZ3",null,5,71,71]
["NZ3",null,5,73,73]
["NZ3",null,5,78,78]
["NZ3",null,5,88,88]
["NZ4",null,5,12,12]
["NZ4",null,5,22,22]
["NZ4",null,5,26,26]
["NZ4",null,5,43,43]
["NZ4",null,5,56,56]
["NZ4",null,5,59,59]
["NZ4",null,5,72,72]
["NZ4",null,5,74,74]
["NZ5",null,5,4,4]
["NZ5",null,5,9,9]
["NZ5",null,5,31,31]
["NZ5",null,5,39,39]
["NZ5",null,5,45,45]
["NZ5",null,5,54,54]
["NZ5",null,5,66,66]
["NZ5",null,5,86,86]
["NZ5",null,5,90,90]
["BA1",null,6,2,2]
["BA1",null,6,7,7]
["BA1",null,6,9,9]
["BA1",null,6,12,12]
["BA1",null,6,29,29]
["BA1",null,6,43,43]
["BA1",null,6,46,46]
["BA1",null,6,68,68]
["BA1",null,6,69,69]
["BA1",null,6,77,77]
["BA1",null,6,80,80]
["BA1",null,6,81,81]
["BA2",null,6,2,2]
["BA2",null,6,12,12]
["BA2",null,6,17,17]
["BA2",null,6,21,21]
["BA2",null,6,30,30]
["BA2",null,6,32,32]
["BA2",null,6,35,35]
["BA2",null,6,47,47]
["BA2",null,6,49,49]
["BA2",null,6,54,54]
["BA2",null,6,58,58]
["BA2",null,6,61,61]
["BA2",null,6,66,66]
["BA2",null,6,84,84]
["BA2",null,6,86,86]
["BA3",null,6,5,5]
["BA3",null,6,7,7]
["BA3",null,6,9,{"$f":"IF(MOD(B1410+D1410,90),MOD(B1410+D1410,90),90)","v":9}]
["BA3",null,6,10,10]
["BA3",null,6,17,17]
["BA3",null,6,24,24]
["BA3",null,6,25,25]
["BA3",null,6,28,28]
["BA3",null,6,29,29]
["BA3",null,6,33,33]
["BA3",null,6,39,39]
["BA3",null,6,40,40]
["BA3",null,6,41,41]
["BA3",null,6,43,43]
["BA3",null,6,65,65]
["BA3",null,6,76,76]
["BA3",null,6,77,77]
["BA3",null,6,79,79]
["BA4",null,6,6,6]
["BA4",null,6,8,8]
["BA4",null,6,12,12]
["BA4",null,6,15,15]
["BA4",null,6,17,17]
["BA4",null,6,22,22]
["BA4",null,6,25,25]
["BA4",null,6,33,33]
["BA4",null,6,36,36]
["BA4",null,6,46,46]
["BA4",null,6,61,61]
["BA4",null,6,71,71]
["BA4",null,6,76,76]
["BA4",null,6,78,78]
["BA4",null,6,79,79]
["BA4",null,6,83,83]
["BA4",null,6,88,88]
["BA4",null,6,89,89]
["BA5",null,6,10,10]
["BA5",null,6,11,11]
["BA5",null,6,12,12]
["BA5",null,6,18,18]
["BA5",null,6,30,30]
["BA5",null,6,31,31]
["BA5",null,6,41,41]
["BA5",null,6,43,43]
["BA5",null,6,50,50]
["BA5",null,6,62,62]
["BA5",null,6,76,76]
["BA5",null,6,83,83]
["BA5",null,6,85,85]
["BA5",null,6,86,86]
["BA5",null,6,88,88]
["CA1",null,6,3,3]
["CA1",null,6,12,12]
["CA1",null,6,27,27]
["CA1",null,6,32,32]
["CA1",null,6,38,38]
["CA1",null,6,43,43]
["CA1",null,6,46,46]
["CA1",null,6,47,47]
["CA1",null,6,51,51]
["CA1",null,6,57,57]
["CA1",null,6,75,75]
["CA1",null,6,84,84]
["CA1",null,6,85,85]
["CA2",null,6,13,13]
["CA2",null,6,20,20]
["CA2",null,6,28,{"$f":"IF(MOD(B1474+D1474,90),MOD(B1474+D1474,90),90)","v":28}]
["CA2",null,6,30,30]
["CA2",null,6,36,36]
["CA2",null,6,38,38]
["CA2",null,6,40,40]
["CA2",null,6,45,45]
["CA2",null,6,54,54]
["CA2",null,6,55,55]
["CA2",null,6,66,66]
["CA2",null,6,68,68]
["CA2",null,6,72,72]
["CA2",null,6,81,81]
["CA2",null,6,83,83]
["CA3",null,6,6,6]
["CA3",null,6,21,21]
["CA3",null,6,26,26]
["CA3",null,6,38,38]
["CA3",null,6,39,39]
["CA3",null,6,40,40]
["CA3",null,6,45,45]
["CA3",null,6,59,59]
["CA3",null,6,61,61]
["CA3",null,6,67,67]
["CA3",null,6,85,85]
["CA3",null,6,87,87]
["CA3",null,6,88,88]
["CA3",null,6,89,89]
["CA4",null,6,3,3]
["CA4",null,6,6,6]
["CA4",null,6,10,10]
["CA4",null,6,11,11]
["CA4",null,6,18,18]
["CA4",null,6,26,26]
["CA4",null,6,29,29]
["CA4",null,6,57,57]
["CA4",null,6,60,60]
["CA4",null,6,62,62]
["CA4",null,6,69,69]
["CA4",null,6,74,74]
["CA4",null,6,76,76]
["CA4",null,6,81,81]
["CA4",null,6,85,85]
["CA4",null,6,87,87]
["CA4",null,6,88,88]
["CA5",null,6,6,6]
["CA5",null,6,13,13]
["CA5",null,6,20,20]
["CA5",null,6,29,29]
["CA5",null,6,30,30]
["CA5",null,6,35,35]
["CA5",null,6,45,45]
["CA5",null,6,52,52]
["CA5",null,6,53,53]
["CA5",null,6,62,62]
["CA5",null,6,63,63]
["CA5",null,6,65,65]
["CA5",null,6,68,68]
["CA5",null,6,69,69]
["CA5",null,6,70,70]
["CA5",null,6,89,89]
["FI1",null,6,1,1]
["FI1",null,6,6,6]
["FI1",null,6,10,10]
["FI1",null,6,12,12]
["FI1",null,6,17,{"$f":"IF(MOD(B1538+D1538,90),MOD(B1538+D1538,90),90)","v":17}]
["FI1",null,6,33,33]
["FI1",null,6,34,34]
["FI1",null,6,38,38]
["FI1",null,6,43,43]
["FI1",null,6,48,48]
["FI1",null,6,49,49]
["FI1",null,6,56,56]
["FI1",null,6,57,57]
["FI1",null,6,61,61]
["FI1",null,6,71,71]
["FI1",null,6,79,79]
["FI1",null,6,90,90]
["FI2",null,6,23,23]
["FI2",null,6,28,28]
["FI2",null,6,36,36]
["FI2",null,6,42,42]
["FI2",null,6,46,46]
["FI2",null,6,48,48]
["FI2",null,6,59,59]
["FI2",null,6,68,68]
["FI2",null,6,86,86]
["FI2",null,6,87,87]
["FI3",null,6,33,33]
["FI3",null,6,46,46]
["FI3",null,6,49,49]
["FI3",null,6,55,55]
["FI3",null,6,58,58]
["FI3",null,6,77,77]
["FI3",null,6,78,78]
["FI3",null,6,81,81]
["FI4",null,6,1,1]
["FI4",null,6,10,10]
["FI4",null,6,13,13]
["FI4",null,6,22,22]
["FI4",null,6,23,23]
["FI4",null,6,33,33]
["FI4",null,6,40,40]
["FI4",null,6,46,46]
["FI4",null,6,48,48]
["FI4",null,6,56,56]
["FI4",null,6,72,72]
["FI4",null,6,73,73]
["FI4",null,6,79,79]
["FI4",null,6,80,80]
["FI4",null,6,86,86]
["FI4",null,6,88,88]
["FI5",null,6,8,8]
["FI5",null,6,17,17]
["FI5",null,6,19,19]
["FI5",null,6,26,26]
["FI5",null,6,28,28]
["FI5",null,6,30,30]
["FI5",null,6,31,31]
["FI5",null,6,32,32]
["FI5",null,6,34,34]
["FI5",null,6,54,54]
["FI5",null,6,57,57]
["FI5",null,6,58,58]
["FI5",null,6,64,64]
["FI5",null,6,74,74]
["FI5",null,6,80,80]
["GE1",null,6,1,1]
["GE1",null,6,4,4]
["GE1",null,6,19,{"$f":"IF(MOD(B1602+D1602,90),MOD(B1602+D1602,90),90)","v":19}]
["GE1",null,6,23,23]
["GE1",null,6,28,28]
["GE1",null,6,33,33]
["GE1",null,6,56,56]
["GE1",null,6,57,57]
["GE1",null,6,62,62]
["GE1",null,6,69,69]
["GE1",null,6,79,79]
["GE2",null,6,1,1]
["GE2",null,6,9,9]
["GE2",null,6,11,11]
["GE2",null,6,22,22]
["GE2",null,6,23,23]
["GE2",null,6,26,26]
["GE2",null,6,27,27]
["GE2",null,6,35,35]
["GE2",null,6,37,37]
["GE2",null,6,38,38]
["GE2",null,6,41,41]
["GE2",null,6,42,42]
["GE2",null,6,55,55]
["GE2",null,6,57,57]
["GE2",null,6,58,58]
["GE2",null,6,66,66]
["GE2",null,6,82,82]
["GE2",null,6,83,83]
["GE3",null,6,8,8]
["GE3",null,6,13,13]
["GE3",null,6,28,28]
["GE3",null,6,32,32]
["GE3",null,6,48,48]
["GE3",null,6,56,56]
["GE3",null,6,67,67]
["GE3",null,6,75,75]
["GE3",null,6,90,90]
["GE4",null,6,10,10]
["GE4",null,6,20,20]
["GE4",null,6,21,21]
["GE4",null,6,39,39]
["GE4",null,6,47,47]
["GE4",null,6,49,49]
["GE4",null,6,54,54]
["GE4",null,6,80,80]
["GE4",null,6,85,85]
["GE5",null,6,1,1]
["GE5",null,6,3,3]
["GE5",null,6,7,7]
["GE5",null,6,12,12]
["GE5",null,6,23,23]
["GE5",null,6,26,26]
["GE5",null,6,29,29]
["GE5",null,6,31,31]
["GE5",null,6,37,37]
["GE5",null,6,42,42]
["GE5",null,6,45,45]
["GE5",null,6,59,59]
["GE5",null,6,63,63]
["GE5",null,6,64,64]
["GE5",null,6,80,80]
["MI1",null,6,4,4]
["MI1",null,6,9,9]
["MI1",null,6,10,10]
["MI1",null,6,16,16]
["MI1",null,6,22,{"$f":"IF(MOD(B1666+D1666,90),MOD(B1666+D1666,90),90)","v":22}]
["MI1",null,6,25,25]
["MI1",null,6,29,29]
["MI1",null,6,30,30]
["MI1",null,6,31,31]
["MI1",null,6,32,32]
["MI1",null,6,43,43]
["MI1",null,6,46,46]
["MI1",null,6,49,49]
["MI1",null,6,51,51]
["MI1",null,6,55,55]
["MI1",null,6,62,62]
["MI1",null,6,71,71]
["MI1",null,6,75,75]
["MI1",null,6,78,78]
["MI1",null,6,83,83]
["MI1",null,6,89,89]
["MI1",null,6,90,90]
["MI2",null,6,4,4]
["MI2",null,6,9,9]
["MI2",null,6,13,13]
["MI2",null,6,18,18]
["MI2",null,6,21,21]
["MI2",null,6,30,30]
["MI2",null,6,38,38]
["MI2",null,6,40,40]
["MI2",null,6,43,43]
["MI2",null,6,44,44]
["MI2",null,6,53,53]
["MI2",null,6,58,58]
["MI2",null,6,66,66]
["MI2",null,6,69,69]
["MI2",null,6,70,70]
["MI2",null,6,79,79]
["MI2",null,6,86,86]
["MI2",null,6,87,87]
["MI2",null,6,89,89]
["MI2",null,6,90,90]
["MI3",null,6,6,6]
["MI3",null,6,10,10]
["MI3",null,6,13,13]
["MI3",null,6,17,17]
["MI3",null,6,27,27]
["MI3",null,6,36,36]
["MI3",null,6,42,42]
["MI3",null,6,49,49]
["MI3",null,6,52,52]
["MI3",null,6,53,53]
["MI3",null,6,55,55]
["MI3",null,6,56,56]
["MI3",null,6,59,59]
["MI3",null,6,60,60]
["MI3",null,6,65,65]
["MI3",null,6,77,77]
["MI3",null,6,80,80]
["MI4",null,6,16,16]
["MI4",null,6,19,19]
["MI4",null,6,20,20]
["MI4",null,6,21,21]
["MI4",null,6,25,25]
["MI4",null,6,31,31]
["MI4",null,6,36,36]
["MI4",null,6,66,66]
["MI4",null,6,81,81]
["MI4",null,6,86,{"$f":"IF(MOD(B1730+D1730,90),MOD(B1730+D1730,90),90)","v":86}]
["MI4",null,6,90,90]
["MI5",null,6,1,1]
["MI5",null,6,4,4]
["MI5",null,6,24,24]
["MI5",null,6,25,25]
["MI5",null,6,26,26]
["MI5",null,6,29,29]
["MI5",null,6,32,32]
["MI5",null,6,67,67]
["MI5",null,6,69,69]
["MI5",null,6,72,72]
["MI5",null,6,82,82]
["MI5",null,6,85,85]
["MI5",null,6,87,87]
["NA1",null,6,4,4]
["NA1",null,6,11,11]
["NA1",null,6,21,21]
["NA1",null,6,23,23]
["NA1",null,6,24,24]
["NA1",null,6,25,25]
["NA1",null,6,46,46]
["NA1",null,6,54,54]
["NA1",null,6,58,58]
["NA1",null,6,68,68]
["NA1",null,6,69,69]
["NA1",null,6,70,70]
["NA1",null,6,74,74]
["NA1",null,6,80,80]
["NA1",null,6,81,81]
["NA1",null,6,84,84]
["NA1",null,6,87,87]
["NA2",null,6,1,1]
["NA2",null,6,6,6]
["NA2",null,6,12,12]
["NA2",null,6,16,16]
["NA2",null,6,17,17]
["NA2",null,6,33,33]
["NA2",null,6,36,36]
["NA2",null,6,38,38]
["NA2",null,6,54,54]
["NA2",null,6,55,55]
["NA2",null,6,58,58]
["NA2",null,6,64,64]
["NA3",null,6,1,1]
["NA3",null,6,9,9]
["NA3",null,6,14,14]
["NA3",null,6,16,16]
["NA3",null,6,20,20]
["NA3",null,6,24,24]
["NA3",null,6,36,36]
["NA3",null,6,43,43]
["NA3",null,6,55,55]
["NA3",null,6,56,56]
["NA3",null,6,67,67]
["NA3",null,6,70,70]
["NA3",null,6,72,72]
["NA3",null,6,73,73]
["NA3",null,6,74,74]
["NA3",null,6,78,78]
["NA3",null,6,84,84]
["NA3",null,6,89,89]
["NA4",null,6,7,7]
["NA4",null,6,8,8]
["NA4",null,6,9,{"$f":"IF(MOD(B1794+D1794,90),MOD(B1794+D1794,90),90)","v":9}]
["NA4",null,6,13,13]
["NA4",null,6,21,21]
["NA4",null,6,28,28]
["NA4",null,6,34,34]
["NA4",null,6,42,42]
["NA4",null,6,44,44]
["NA4",null,6,52,52]
["NA4",null,6,54,54]
["NA4",null,6,55,55]
["NA4",null,6,71,71]
["NA4",null,6,76,76]
["NA4",null,6,77,77]
["NA4",null,6,79,79]
["NA4",null,6,80,80]
["NA5",null,6,2,2]
["NA5",null,6,3,3]
["NA5",null,6,8,8]
["NA5",null,6,12,12]
["NA5",null,6,17,17]
["NA5",null,6,21,21]
["NA5",null,6,25,25]
["NA5",null,6,28,28]
["NA5",null,6,35,35]
["NA5",null,6,39,39]
["NA5",null,6,44,44]
["NA5",null,6,46,46]
["NA5",null,6,56,56]
["NA5",null,6,63,63]
["NA5",null,6,70,70]
["NA5",null,6,77,77]
["NA5",null,6,78,78]
["PA1",null,6,2,2]
["PA1",null,6,4,4]
["PA1",null,6,15,15]
["PA1",null,6,19,19]
["PA1",null,6,29,29]
["PA1",null,6,31,31]
["PA1",null,6,32,32]
["PA1",null,6,37,37]
["PA1",null,6,46,46]
["PA1",null,6,48,48]
["PA1",null,6,50,50]
["PA1",null,6,53,53]
["PA1",null,6,64,64]
["PA1",null,6,71,71]
["PA1",null,6,81,81]
["PA2",null,6,8,8]
["PA2",null,6,13,13]
["PA2",null,6,22,22]
["PA2",null,6,25,25]
["PA2",null,6,27,27]
["PA2",null,6,31,31]
["PA2",null,6,34,34]
["PA2",null,6,54,54]
["PA2",null,6,77,77]
["PA2",null,6,87,87]
["PA3",null,6,1,1]
["PA3",null,6,5,5]
["PA3",null,6,11,11]
["PA3",null,6,32,32]
["PA3",null,6,34,34]
["PA3",null,6,38,38]
["PA3",null,6,46,46]
["PA3",null,6,49,{"$f":"IF(MOD(B1858+D1858,90),MOD(B1858+D1858,90),90)","v":49}]
["PA3",null,6,53,53]
["PA3",null,6,57,57]
["PA3",null,6,65,65]
["PA3",null,6,67,67]
["PA3",null,6,68,68]
["PA3",null,6,70,70]
["PA3",null,6,72,72]
["PA3",null,6,77,77]
["PA3",null,6,78,78]
["PA3",null,6,83,83]
["PA4",null,6,4,4]
["PA4",null,6,5,5]
["PA4",null,6,8,8]
["PA4",null,6,26,26]
["PA4",null,6,43,43]
["PA4",null,6,58,58]
["PA4",null,6,65,65]
["PA5",null,6,14,14]
["PA5",null,6,45,45]
["PA5",null,6,46,46]
["PA5",null,6,49,49]
["PA5",null,6,71,71]
["PA5",null,6,75,75]
["PA5",null,6,78,78]
["PA5",null,6,90,90]
["RO1",null,6,10,10]
["RO1",null,6,12,12]
["RO1",null,6,17,17]
["RO1",null,6,19,19]
["RO1",null,6,24,24]
["RO1",null,6,28,28]
["RO1",null,6,42,42]
["RO1",null,6,43,43]
["RO1",null,6,52,52]
["RO1",null,6,59,59]
["RO1",null,6,62,62]
["RO1",null,6,76,76]
["RO1",null,6,78,78]
["RO1",null,6,80,80]
["RO1",null,6,81,81]
["RO1",null,6,88,88]
["RO1",null,6,89,89]
["RO1",null,6,90,90]
["RO2",null,6,2,2]
["RO2",null,6,16,16]
["RO2",null,6,26,26]
["RO2",null,6,29,29]
["RO2",null,6,30,30]
["RO2",null,6,36,36]
["RO2",null,6,38,38]
["RO2",null,6,43,43]
["RO2",null,6,46,46]
["RO2",null,6,67,67]
["RO2",null,6,69,69]
["RO2",null,6,77,77]
["RO2",null,6,80,80]
["RO2",null,6,81,81]
["RO3",null,6,1,1]
["RO3",null,6,11,11]
["RO3",null,6,14,14]
["RO3",null,6,29,29]
["RO3",null,6,31,31]
["RO3",null,6,45,45]
["RO3",null,6,48,{"$f":"IF(MOD(B1922+D1922,90),MOD(B1922+D1922,90),90)","v":48}]
["RO3",null,6,53,53]
["RO3",null,6,84,84]
["RO3",null,6,85,85]
["RO4",null,6,11,11]
["RO4",null,6,13,13]
["RO4",null,6,22,22]
["RO4",null,6,43,43]
["RO4",null,6,44,44]
["RO4",null,6,49,49]
["RO4",null,6,50,50]
["RO4",null,6,52,52]
["RO4",null,6,54,54]
["RO4",null,6,65,65]
["RO4",null,6,70,70]
["RO4",null,6,87,87]
["RO5",null,6,4,4]
["RO5",null,6,11,11]
["RO5",null,6,12,12]
["RO5",null,6,14,14]
["RO5",null,6,24,24]
["RO5",null,6,32,32]
["RO5",null,6,36,36]
["RO5",null,6,38,38]
["RO5",null,6,41,41]
["RO5",null,6,42,42]
["RO5",null,6,43,43]
["RO5",null,6,44,44]
["RO5",null,6,52,52]
["RO5",null,6,64,64]
["RO5",null,6,68,68]
["RO5",null,6,71,71]
["RO5",null,6,74,74]
["RO5",null,6,76,76]
["RO5",null,6,80,80]
["RO5",null,6,83,83]
["RO5",null,6,87,87]
["RO5",null,6,89,89]
["TO1",null,6,8,8]
["TO1",null,6,9,9]
["TO1",null,6,12,12]
["TO1",null,6,15,15]
["TO1",null,6,21,21]
["TO1",null,6,35,35]
["TO1",null,6,37,37]
["TO1",null,6,56,56]
["TO1",null,6,58,58]
["TO1",null,6,64,64]
["TO1",null,6,70,70]
["TO1",null,6,75,75]
["TO1",null,6,81,81]
["TO1",null,6,84,84]
["TO1",null,6,88,88]
["TO1",null,6,90,90]
["TO2",null,6,10,10]
["TO2",null,6,48,48]
["TO2",null,6,55,55]
["TO2",null,6,56,56]
["TO2",null,6,72,72]
["TO2",null,6,88,88]
["TO3",null,6,2,2]
["TO3",null,6,3,3]
["TO3",null,6,8,8]
["TO3",null,6,9,9]
["TO3",null,6,16,{"$f":"IF(MOD(B1986+D1986,90),MOD(B1986+D1986,90),90)","v":16}]
["TO3",null,6,39,39]
["TO3",null,6,41,41]
["TO3",null,6,55,55]
["TO3",null,6,62,62]
["TO3",null,6,72,72]
["TO3",null,6,74,74]
["TO3",null,6,75,75]
["TO3",null,6,84,84]
["TO3",null,6,87,87]
["TO3",null,6,90,90]
["TO4",null,6,7,7]
["TO4",null,6,15,15]
["TO4",null,6,28,28]
["TO4",null,6,34,34]
["TO4",null,6,35,35]
["TO4",null,6,42,42]
["TO4",null,6,43,43]
["TO4",null,6,47,47]
["TO4",null,6,50,50]
["TO4",null,6,56,56]
["TO4",null,6,72,72]
["TO4",null,6,77,77]
["TO5",null,6,2,2]
["TO5",null,6,18,18]
["TO5",null,6,29,29]
["TO5",null,6,36,36]
["TO5",null,6,47,47]
["TO5",null,6,59,59]
["TO5",null,6,60,60]
["TO5",null,6,65,65]
["TO5",null,6,75,75]
["TO5",null,6,77,77]
["TO5",null,6,78,78]
["TO5",null,6,83,83]
["TO5",null,6,85,85]
["TO5",null,6,88,88]
["VE1",null,6,7,7]
["VE1",null,6,8,8]
["VE1",null,6,10,10]
["VE1",null,6,16,16]
["VE1",null,6,30,30]
["VE1",null,6,42,42]
["VE1",null,6,44,44]
["VE1",null,6,52,52]
["VE1",null,6,60,60]
["VE1",null,6,61,61]
["VE1",null,6,71,71]
["VE1",null,6,77,77]
["VE1",null,6,83,83]
["VE2",null,6,12,12]
["VE2",null,6,19,19]
["VE2",null,6,29,29]
["VE2",null,6,46,46]
["VE2",null,6,49,49]
["VE2",null,6,76,76]
["VE2",null,6,86,86]
["VE3",null,6,2,2]
["VE3",null,6,9,9]
["VE3",null,6,10,10]
["VE3",null,6,17,17]
["VE3",null,6,18,18]
["VE3",null,6,19,19]
["VE3",null,6,20,20]
["VE3",null,6,26,{"$f":"IF(MOD(B2050+D2050,90),MOD(B2050+D2050,90),90)","v":26}]
["VE3",null,6,27,27]
["VE3",null,6,35,35]
["VE3",null,6,37,37]
["VE3",null,6,42,42]
["VE3",null,6,45,45]
["VE3",null,6,47,47]
["VE3",null,6,61,61]
["VE3",null,6,63,63]
["VE3",null,6,71,71]
["VE3",null,6,76,76]
["VE3",null,6,80,80]
["VE4",null,6,4,4]
["VE4",null,6,6,6]
["VE4",null,6,43,43]
["VE4",null,6,48,48]
["VE4",null,6,73,73]
["VE5",null,6,1,1]
["VE5",null,6,4,4]
["VE5",null,6,6,6]
["VE5",null,6,17,17]
["VE5",null,6,23,23]
["VE5",null,6,28,28]
["VE5",null,6,29,29]
["VE5",null,6,30,30]
["VE5",null,6,35,35]
["VE5",null,6,48,48]
["VE5",null,6,51,51]
["VE5",null,6,53,53]
["VE5",null,6,63,63]
["VE5",null,6,69,69]
["VE5",null,6,76,76]
["VE5",null,6,77,77]
["VE5",null,6,82,82]
["VE5",null,6,84,84]
["VE5",null,6,87,87]
["NZ1",null,6,9,9]
["NZ1",null,6,19,19]
["NZ1",null,6,22,22]
["NZ1",null,6,23,23]
["NZ1",null,6,43,43]
["NZ1",null,6,46,46]
["NZ1",null,6,61,61]
["NZ1",null,6,62,62]
["NZ1",null,6,70,70]
["NZ1",null,6,77,77]
["NZ2",null,6,7,7]
["NZ2",null,6,12,12]
["NZ2",null,6,16,16]
["NZ2",null,6,19,19]
["NZ2",null,6,24,24]
["NZ2",null,6,36,36]
["NZ2",null,6,41,41]
["NZ2",null,6,43,43]
["NZ2",null,6,51,51]
["NZ2",null,6,52,52]
["NZ2",null,6,57,57]
["NZ2",null,6,58,58]
["NZ2",null,6,61,61]
["NZ2",null,6,63,63]
["NZ2",null,6,66,66]
["NZ2",null,6,67,67]
["NZ2",null,6,76,76]
["NZ2",null,6,83,83]
["NZ2",null,6,84,{"$f":"IF(MOD(B2114+D2114,90),MOD(B2114+D2114,90),90)","v":84}]
["NZ2",null,6,89,89]
["NZ3",null,6,6,6]
["NZ3",null,6,15,15]
["NZ3",null,6,17,17]
["NZ3",null,6,21,21]
["NZ3",null,6,26,26]
["NZ3",null,6,30,30]
["NZ3",null,6,49,49]
["NZ3",null,6,54,54]
["NZ3",null,6,81,81]
["NZ4",null,6,1,1]
["NZ4",null,6,8,8]
["NZ4",null,6,9,9]
["NZ4",null,6,13,13]
["NZ4",null,6,21,21]
["NZ4",null,6,28,28]
["NZ4",null,6,29,29]
["NZ4",null,6,31,31]
["NZ4",null,6,34,34]
["NZ4",null,6,42,42]
["NZ4",null,6,44,44]
["NZ4",null,6,58,58]
["NZ4",null,6,63,63]
["NZ4",null,6,67,67]
["NZ4",null,6,69,69]
["NZ4",null,6,76,76]
["NZ5",null,6,1,1]
["NZ5",null,6,7,7]
["NZ5",null,6,12,12]
["NZ5",null,6,13,13]
["NZ5",null,6,23,23]
["NZ5",null,6,24,24]
["NZ5",null,6,33,33]
["NZ5",null,6,72,72]
["NZ5",null,6,77,77]
["NZ5",null,6,80,80]
["NZ5",null,6,81,81]
["NZ5",null,6,87,87]
["BA1",null,7,4,4]
["BA1",null,7,10,10]
["BA1",null,7,13,13]
["BA1",null,7,17,17]
["BA1",null,7,21,21]
["BA1",null,7,27,27]
["BA1",null,7,31,31]
["BA1",null,7,34,34]
["BA1",null,7,38,38]
["BA1",null,7,50,50]
["BA1",null,7,57,57]
["BA1",null,7,59,59]
["BA1",null,7,60,60]
["BA1",null,7,62,62]
["BA1",null,7,71,71]
["BA1",null,7,72,72]
["BA1",null,7,78,78]
["BA2",null,7,5,5]
["BA2",null,7,19,19]
["BA2",null,7,22,22]
["BA2",null,7,28,28]
["BA2",null,7,39,39]
["BA2",null,7,40,40]
["BA2",null,7,60,60]
["BA2",null,7,65,65]
["BA2",null,7,68,{"$f":"IF(MOD(B2178+D2178,90),MOD(B2178+D2178,90),90)","v":68}]
["BA2",null,7,73,73]
["BA2",null,7,77,77]
["BA2",null,7,78,78]
["BA2",null,7,79,79]
["BA3",null,7,12,12]
["BA3",null,7,16,16]
["BA3",null,7,30,30]
["BA3",null,7,36,36]
["BA3",null,7,45,45]
["BA3",null,7,48,48]
["BA3",null,7,56,56]
["BA3",null,7,66,66]
["BA3",null,7,68,68]
["BA3",null,7,78,78]
["BA3",null,7,80,80]
["BA3",null,7,82,82]
["BA4",null,7,7,7]
["BA4",null,7,38,38]
["BA4",null,7,52,52]
["BA4",null,7,53,53]
["BA4",null,7,58,58]
["BA4",null,7,74,74]
["BA4",null,7,84,84]
["BA4",null,7,85,85]
["BA4",null,7,86,86]
["BA5",null,7,2,2]
["BA5",null,7,5,5]
["BA5",null,7,6,6]
["BA5",null,7,8,8]
["BA5",null,7,23,23]
["BA5",null,7,32,32]
["BA5",null,7,36,36]
["BA5",null,7,37,37]
["BA5",null,7,40,40]
["BA5",null,7,45,45]
["BA5",null,7,46,46]
["BA5",null,7,53,53]
["BA5",null,7,54,54]
["BA5",null,7,59,59]
["BA5",null,7,63,63]
["BA5",null,7,70,70]
["BA5",null,7,87,87]
["CA1",null,7,18,18]
["CA1",null,7,21,21]
["CA1",null,7,42,42]
["CA1",null,7,52,52]
["CA1",null,7,55,55]
["CA1",null,7,56,56]
["CA1",null,7,58,58]
["CA1",null,7,59,59]
["CA1",null,7,70,70]
["CA1",null,7,71,71]
["CA1",null,7,80,80]
["CA1",null,7,82,82]
["CA1",null,7,86,86]
["CA2",null,7,5,5]
["CA2",null,7,16,16]
["CA2",null,7,19,19]
["CA2",null,7,21,21]
["CA2",null,7,22,22]
["CA2",null,7,23,23]
["CA2",null,7,47,47]
["CA2",null,7,51,51]
["CA2",null,7,59,{"$f":"IF(MOD(B2242+D2242,90),MOD(B2242+D2242,90),90)","v":59}]
["CA2",null,7,62,62]
["CA2",null,7,67,67]
["CA2",null,7,84,84]
["CA2",null,7,90,90]
["CA3",null,7,1,1]
["CA3",null,7,2,2]
["CA3",null,7,14,14]
["CA3",null,7,16,16]
["CA3",null,7,18,18]
["CA3",null,7,19,19]
["CA3",null,7,22,22]
["CA3",null,7,23,23]
["CA3",null,7,27,27]
["CA3",null,7,29,29]
["CA3",null,7,31,31]
["CA3",null,7,36,36]
["CA3",null,7,48,48]
["CA3",null,7,51,51]
["CA3",null,7,53,53]
["CA3",null,7,70,70]
["CA3",null,7,78,78]
["CA4",null,7,7,7]
["CA4",null,7,14,14]
["CA4",null,7,24,24]
["CA4",null,7,27,27]
["CA4",null,7,30,30]
["CA4",null,7,33,33]
["CA4",null,7,41,41]
["CA4",null,7,45,45]
["CA4",null,7,47,47]
["CA4",null,7,51,51]
["CA4",null,7,53,53]
["CA4",null,7,82,82]
["CA5",null,7,2,2]
["CA5",null,7,16,16]
["CA5",null,7,22,22]
["CA5",null,7,24,24]
["CA5",null,7,31,31]
["CA5",null,7,43,43]
["CA5",null,7,47,47]
["CA5",null,7,79,79]
["CA5",null,7,88,88]
["FI1",null,7,3,3]
["FI1",null,7,5,5]
["FI1",null,7,8,8]
["FI1",null,7,14,14]
["FI1",null,7,26,26]
["FI1",null,7,28,28]
["FI1",null,7,29,29]
["FI1",null,7,32,32]
["FI1",null,7,35,35]
["FI1",null,7,41,41]
["FI1",null,7,44,44]
["FI1",null,7,47,47]
["FI1",null,7,63,63]
["FI1",null,7,72,72]
["FI1",null,7,80,80]
["FI1",null,7,86,86]
["FI2",null,7,6,6]
["FI2",null,7,8,8]
["FI2",null,7,9,9]
["FI2",null,7,10,10]
["FI2",null,7,18,18]
["FI2",null,7,25,{"$f":"IF(MOD(B2306+D2306,90),MOD(B2306+D2306,90),90)","v":25}]
["FI2",null,7,31,31]
["FI2",null,7,43,43]
["FI2",null,7,45,45]
["FI2",null,7,52,52]
["FI2",null,7,57,57]
["FI2",null,7,70,70]
["FI2",null,7,79,79]
["FI2",null,7,85,85]
["FI3",null,7,4,4]
["FI3",null,7,6,6]
["FI3",null,7,7,7]
["FI3",null,7,16,16]
["FI3",null,7,20,20]
["FI3",null,7,44,44]
["FI3",null,7,48,48]
["FI3",null,7,56,56]
["FI3",null,7,59,59]
["FI3",null,7,66,66]
["FI3",null,7,67,67]
["FI3",null,7,71,71]
["FI3",null,7,74,74]
["FI3",null,7,75,75]
["FI3",null,7,76,76]
["FI3",null,7,79,79]
["FI3",null,7,82,82]
["FI3",null,7,89,89]
["FI4",null,7,43,43]
["FI4",null,7,45,45]
["FI4",null,7,47,47]
["FI4",null,7,49,49]
["FI4",null,7,59,59]
["FI4",null,7,64,64]
["FI4",null,7,65,65]
["FI4",null,7,70,70]
["FI4",null,7,75,75]
["FI4",null,7,85,85]
["FI5",null,7,1,1]
["FI5",null,7,11,11]
["FI5",null,7,12,12]
["FI5",null,7,20,20]
["FI5",null,7,25,25]
["FI5",null,7,36,36]
["FI5",null,7,37,37]
["FI5",null,7,38,38]
["FI5",null,7,44,44]
["FI5",null,7,84,84]
["FI5",null,7,88,88]
["FI5",null,7,90,90]
["GE1",null,7,9,9]
["GE1",null,7,11,11]
["GE1",null,7,12,12]
["GE1",null,7,27,27]
["GE1",null,7,30,30]
["GE1",null,7,34,34]
["GE1",null,7,38,38]
["GE1",null,7,46,46]
["GE1",null,7,48,48]
["GE1",null,7,49,49]
["GE1",null,7,51,51]
["GE1",null,7,54,54]
["GE1",null,7,58,58]
["GE1",null,7,66,66]
["GE1",null,7,71,71]
["GE1",null,7,76,{"$f":"IF(MOD(B2370+D2370,90),MOD(B2370+D2370,90),90)","v":76}]
["GE1",null,7,81,81]
["GE2",null,7,15,15]
["GE2",null,7,25,25]
["GE2",null,7,28,28]
["GE2",null,7,53,53]
["GE2",null,7,60,60]
["GE2",null,7,78,78]
["GE2",null,7,86,86]
["GE2",null,7,89,89]
["GE3",null,7,7,7]
["GE3",null,7,11,11]
["GE3",null,7,19,19]
["GE3",null,7,21,21]
["GE3",null,7,26,26]
["GE3",null,7,31,31]
["GE3",null,7,45,45]
["GE3",null,7,52,52]
["GE3",null,7,55,55]
["GE3",null,7,58,58]
["GE3",null,7,59,59]
["GE3",null,7,65,65]
["GE3",null,7,69,69]
["GE3",null,7,70,70]
["GE3",null,7,81,81]
["GE3",null,7,87,87]
["GE3",null,7,88,88]
["GE3",null,7,89,89]
["GE4",null,7,5,5]
["GE4",null,7,7,7]
["GE4",null,7,12,12]
["GE4",null,7,13,13]
["GE4",null,7,16,16]
["GE4",null,7,23,23]
["GE4",null,7,26,26]
["GE4",null,7,34,34]
["GE4",null,7,36,36]
["GE4",null,7,43,43]
["GE4",null,7,46,46]
["GE4",null,7,52,52]
["GE4",null,7,55,55]
["GE4",null,7,60,60]
["GE4",null,7,66,66]
["GE5",null,7,4,4]
["GE5",null,7,9,9]
["GE5",null,7,21,21]
["GE5",null,7,22,22]
["GE5",null,7,24,24]
["GE5",null,7,30,30]
["GE5",null,7,33,33]
["GE5",null,7,40,40]
["GE5",null,7,46,46]
["GE5",null,7,48,48]
["GE5",null,7,55,55]
["GE5",null,7,77,77]
["GE5",null,7,79,79]
["GE5",null,7,81,81]
["MI1",null,7,8,8]
["MI1",null,7,20,20]
["MI1",null,7,23,23]
["MI1",null,7,36,36]
["MI1",null,7,38,38]
["MI1",null,7,39,39]
["MI1",null,7,45,45]
["MI1",null,7,56,{"$f":"IF(MOD(B2434+D2434,90),MOD(B2434+D2434,90),90)","v":56}]
["MI1",null,7,58,58]
["MI1",null,7,59,59]
["MI1",null,7,60,60]
["MI1",null,7,68,68]
["MI1",null,7,79,79]
["MI1",null,7,86,86]
["MI2",null,7,14,14]
["MI2",null,7,15,15]
["MI2",null,7,25,25]
["MI2",null,7,26,26]
["MI2",null,7,27,27]
["MI2",null,7,37,37]
["MI2",null,7,41,41]
["MI2",null,7,52,52]
["MI2",null,7,55,55]
["MI2",null,7,57,57]
["MI2",null,7,60,60]
["MI2",null,7,68,68]
["MI2",null,7,74,74]
["MI2",null,7,80,80]
["MI2",null,7,83,83]
["MI2",null,7,84,84]
["MI2",null,7,85,85]
["MI2",null,7,88,88]
["MI3",null,7,7,7]
["MI3",null,7,8,8]
["MI3",null,7,9,9]
["MI3",null,7,14,14]
["MI3",null,7,28,28]
["MI3",null,7,33,33]
["MI3",null,7,38,38]
["MI3",null,7,41,41]
["MI3",null,7,63,63]
["MI3",null,7,69,69]
["MI3",null,7,70,70]
["MI3",null,7,74,74]
["MI3",null,7,82,82]
["MI3",null,7,83,83]
["MI3",null,7,85,85]
["MI4",null,7,5,5]
["MI4",null,7,7,7]
["MI4",null,7,12,12]
["MI4",null,7,14,14]
["MI4",null,7,28,28]
["MI4",null,7,34,34]
["MI4",null,7,38,38]
["MI4",null,7,39,39]
["MI4",null,7,61,61]
["MI4",null,7,63,63]
["MI4",null,7,64,64]
["MI4",null,7,67,67]
["MI4",null,7,69,69]
["MI4",null,7,72,72]
["MI4",null,7,76,76]
["MI4",null,7,78,78]
["MI4",null,7,82,82]
["MI4",null,7,88,88]
["MI4",null,7,89,89]
["MI5",null,7,2,2]
["MI5",null,7,3,3]
["MI5",null,7,5,5]
["MI5",null,7,12,12]
["MI5",null,7,16,16]
["MI5",null,7,40,{"$f":"IF(MOD(B2498+D2498,90),MOD(B2498+D2498,90),90)","v":40}]
["MI5",null,7,43,43]
["MI5",null,7,51,51]
["MI5",null,7,55,55]
["MI5",null,7,66,66]
["MI5",null,7,70,70]
["MI5",null,7,80,80]
["NA1",null,7,3,3]
["NA1",null,7,5,5]
["NA1",null,7,13,13]
["NA1",null,7,29,29]
["NA1",null,7,35,35]
["NA1",null,7,38,38]
["NA1",null,7,40,40]
["NA1",null,7,49,49]
["NA1",null,7,52,52]
["NA1",null,7,56,56]
["NA1",null,7,65,65]
["NA1",null,7,75,75]
["NA1",null,7,82,82]
["NA2",null,7,2,2]
["NA2",null,7,4,4]
["NA2",null,7,15,15]
["NA2",null,7,19,19]
["NA2",null,7,24,24]
["NA2",null,7,26,26]
["NA2",null,7,27,27]
["NA2",null,7,28,28]
["NA2",null,7,29,29]
["NA2",null,7,30,30]
["NA2",null,7,45,45]
["NA2",null,7,49,49]
["NA2",null,7,62,62]
["NA2",null,7,76,76]
["NA2",null,7,77,77]
["NA2",null,7,78,78]
["NA2",null,7,84,84]
["NA3",null,7,3,3]
["NA3",null,7,13,13]
["NA3",null,7,33,33]
["NA3",null,7,34,34]
["NA3",null,7,35,35]
["NA3",null,7,37,37]
["NA3",null,7,46,46]
["NA3",null,7,47,47]
["NA3",null,7,54,54]
["NA3",null,7,57,57]
["NA3",null,7,58,58]
["NA3",null,7,65,65]
["NA3",null,7,79,79]
["NA3",null,7,83,83]
["NA4",null,7,4,4]
["NA4",null,7,10,10]
["NA4",null,7,18,18]
["NA4",null,7,23,23]
["NA4",null,7,31,31]
["NA4",null,7,47,47]
["NA4",null,7,69,69]
["NA4",null,7,81,81]
["NA4",null,7,90,90]
["NA5",null,7,1,1]
["NA5",null,7,9,9]
["NA5",null,7,14,14]
["NA5",null,7,15,15]
["NA5",null,7,18,{"$f":"IF(MOD(B2562+D2562,90),MOD(B2562+D2562,90),90)","v":18}]
["NA5",null,7,22,22]
["NA5",null,7,27,27]
["NA5",null,7,41,41]
["NA5",null,7,43,43]
["NA5",null,7,47,47]
["NA5",null,7,48,48]
["NA5",null,7,49,49]
["NA5",null,7,51,51]
["NA5",null,7,54,54]
["NA5",null,7,67,67]
["NA5",null,7,81,81]
["NA5",null,7,84,84]
["PA1",null,7,1,1]
["PA1",null,7,17,17]
["PA1",null,7,22,22]
["PA1",null,7,24,24]
["PA1",null,7,25,25]
["PA1",null,7,27,27]
["PA1",null,7,55,55]
["PA1",null,7,66,66]
["PA1",null,7,77,77]
["PA1",null,7,86,86]
["PA1",null,7,90,90]
["PA2",null,7,4,4]
["PA2",null,7,10,10]
["PA2",null,7,21,21]
["PA2",null,7,29,29]
["PA2",null,7,32,32]
["PA2",null,7,49,49]
["PA2",null,7,52,52]
["PA2",null,7,63,63]
["PA2",null,7,78,78]
["PA2",null,7,82,82]
["PA2",null,7,83,83]
["PA3",null,7,7,7]
["PA3",null,7,12,12]
["PA3",null,7,40,40]
["PA3",null,7,43,43]
["PA3",null,7,56,56]
["PA3",null,7,75,75]
["PA3",null,7,81,81]
["PA3",null,7,89,89]
["PA4",null,7,3,3]
["PA4",null,7,9,9]
["PA4",null,7,16,16]
["PA4",null,7,18,18]
["PA4",null,7,24,24]
["PA4",null,7,25,25]
["PA4",null,7,30,30]
["PA4",null,7,33,33]
["PA4",null,7,41,41]
["PA4",null,7,42,42]
["PA4",null,7,44,44]
["PA4",null,7,50,50]
["PA4",null,7,54,54]
["PA4",null,7,61,61]
["PA4",null,7,75,75]
["PA4",null,7,81,81]
["PA5",null,7,24,24]
["PA5",null,7,25,25]
["PA5",null,7,29,29]
["PA5",null,7,34,34]
["PA5",null,7,57,57]
["PA5",null,7,61,{"$f":"IF(MOD(B2626+D2626,90),MOD(B2626+D2626,90),90)","v":61}]
["PA5",null,7,76,76]
["PA5",null,7,82,82]
["PA5",null,7,84,84]
["PA5",null,7,85,85]
["RO1",null,7,11,11]
["RO1",null,7,16,16]
["RO1",null,7,18,18]
["RO1",null,7,25,25]
["RO1",null,7,33,33]
["RO1",null,7,39,39]
["RO1",null,7,56,56]
["RO1",null,7,65,65]
["RO1",null,7,68,68]
["RO2",null,7,3,3]
["RO2",null,7,5,5]
["RO2",null,7,6,6]
["RO2",null,7,17,17]
["RO2",null,7,28,28]
["RO2",null,7,32,32]
["RO2",null,7,34,34]
["RO2",null,7,35,35]
["RO2",null,7,50,50]
["RO2",null,7,51,51]
["RO2",null,7,60,60]
["RO2",null,7,63,63]
["RO2",null,7,68,68]
["RO2",null,7,72,72]
["RO3",null,7,5,5]
["RO3",null,7,15,15]
["RO3",null,7,41,41]
["RO3",null,7,57,57]
["RO3",null,7,59,59]
["RO3",null,7,73,73]
["RO3",null,7,75,75]
["RO3",null,7,81,81]
["RO4",null,7,1,1]
["RO4",null,7,2,2]
["RO4",null,7,3,3]
["RO4",null,7,10,10]
["RO4",null,7,15,15]
["RO4",null,7,21,21]
["RO4",null,7,30,30]
["RO4",null,7,31,31]
["RO4",null,7,33,33]
["RO4",null,7,35,35]
["RO4",null,7,36,36]
["RO4",null,7,45,45]
["RO4",null,7,51,51]
["RO4",null,7,73,73]
["RO4",null,7,77,77]
["RO4",null,7,82,82]
["RO4",null,7,83,83]
["RO4",null,7,85,85]
["RO4",null,7,86,86]
["RO4",null,7,88,88]
["RO5",null,7,1,1]
["RO5",null,7,3,3]
["RO5",null,7,9,9]
["RO5",null,7,16,16]
["RO5",null,7,18,18]
["RO5",null,7,49,49]
["RO5",null,7,55,55]
["RO5",null,7,73,73]
["RO5",null,7,81,{"$f":"IF(MOD(B2690+D2690,90),MOD(B2690+D2690,90),90)","v":81}]
["RO5",null,7,82,82]
["RO5",null,7,86,86]
["TO1",null,7,1,1]
["TO1",null,7,4,4]
["TO1",null,7,24,24]
["TO1",null,7,27,27]
["TO1",null,7,31,31]
["TO1",null,7,32,32]
["TO1",null,7,34,34]
["TO1",null,7,38,38]
["TO1",null,7,40,40]
["TO1",null,7,47,47]
["TO1",null,7,51,51]
["TO1",null,7,60,60]
["TO1",null,7,67,67]
["TO1",null,7,74,74]
["TO1",null,7,85,85]
["TO1",null,7,86,86]
["TO2",null,7,7,7]
["TO2",null,7,8,8]
["TO2",null,7,12,12]
["TO2",null,7,21,21]
["TO2",null,7,22,22]
["TO2",null,7,31,31]
["TO2",null,7,45,45]
["TO2",null,7,52,52]
["TO2",null,7,65,65]
["TO2",null,7,66,66]
["TO2",null,7,67,67]
["TO2",null,7,69,69]
["TO2",null,7,73,73]
["TO2",null,7,77,77]
["TO2",null,7,86,86]
["TO3",null,7,5,5]
["TO3",null,7,7,7]
["TO3",null,7,14,14]
["TO3",null,7,15,15]
["TO3",null,7,18,18]
["TO3",null,7,22,22]
["TO3",null,7,28,28]
["TO3",null,7,40,40]
["TO3",null,7,58,58]
["TO3",null,7,59,59]
["TO3",null,7,60,60]
["TO3",null,7,66,66]
["TO3",null,7,69,69]
["TO3",null,7,73,73]
["TO3",null,7,78,78]
["TO3",null,7,79,79]
["TO3",null,7,82,82]
["TO3",null,7,83,83]
["TO3",null,7,85,85]
["TO4",null,7,3,3]
["TO4",null,7,6,6]
["TO4",null,7,11,11]
["TO4",null,7,13,13]
["TO4",null,7,22,22]
["TO4",null,7,25,25]
["TO4",null,7,26,26]
["TO4",null,7,29,29]
["TO4",null,7,32,32]
["TO4",null,7,37,37]
["TO4",null,7,46,46]
["TO4",null,7,54,{"$f":"IF(MOD(B2754+D2754,90),MOD(B2754+D2754,90),90)","v":54}]
["TO4",null,7,66,66]
["TO4",null,7,75,75]
["TO4",null,7,76,76]
["TO4",null,7,78,78]
["TO4",null,7,83,83]
["TO5",null,7,8,8]
["TO5",null,7,9,9]
["TO5",null,7,22,22]
["TO5",null,7,24,24]
["TO5",null,7,35,35]
["TO5",null,7,52,52]
["TO5",null,7,54,54]
["TO5",null,7,73,73]
["TO5",null,7,79,79]
["TO5",null,7,80,80]
["TO5",null,7,86,86]
["VE1",null,7,1,1]
["VE1",null,7,22,22]
["VE1",null,7,28,28]
["VE1",null,7,29,29]
["VE1",null,7,31,31]
["VE1",null,7,35,35]
["VE1",null,7,39,39]
["VE1",null,7,41,41]
["VE1",null,7,49,49]
["VE1",null,7,53,53]
["VE1",null,7,54,54]
["VE1",null,7,57,57]
["VE1",null,7,74,74]
["VE1",null,7,81,81]
["VE1",null,7,82,82]
["VE2",null,7,6,6]
["VE2",null,7,7,7]
["VE2",null,7,13,13]
["VE2",null,7,14,14]
["VE2",null,7,16,16]
["VE2",null,7,21,21]
["VE2",null,7,24,24]
["VE2",null,7,28,28]
["VE2",null,7,35,35]
["VE2",null,7,45,45]
["VE2",null,7,51,51]
["VE2",null,7,53,53]
["VE2",null,7,55,55]
["VE2",null,7,56,56]
["VE2",null,7,57,57]
["VE2",null,7,61,61]
["VE2",null,7,62,62]
["VE2",null,7,66,66]
["VE2",null,7,69,69]
["VE2",null,7,72,72]
["VE2",null,7,73,73]
["VE2",null,7,77,77]
["VE2",null,7,80,80]
["VE3",null,7,3,3]
["VE3",null,7,6,6]
["VE3",null,7,7,7]
["VE3",null,7,23,23]
["VE3",null,7,30,30]
["VE3",null,7,39,39]
["VE3",null,7,46,46]
["VE3",null,7,59,59]
["VE3",null,7,60,60]
["VE3",null,7,66,{"$f":"IF(MOD(B2818+D2818,90),MOD(B2818+D2818,90),90)","v":66}]
["VE3",null,7,69,69]
["VE3",null,7,79,79]
["VE3",null,7,81,81]
["VE3",null,7,82,82]
["VE3",null,7,87,87]
["VE3",null,7,89,89]
["VE4",null,7,12,12]
["VE4",null,7,13,13]
["VE4",null,7,14,14]
["VE4",null,7,16,16]
["VE4",null,7,35,35]
["VE4",null,7,38,38]
["VE4",null,7,42,42]
["VE4",null,7,53,53]
["VE4",null,7,59,59]
["VE4",null,7,60,60]
["VE4",null,7,62,62]
["VE4",null,7,65,65]
["VE4",null,7,71,71]
["VE4",null,7,72,72]
["VE4",null,7,78,78]
["VE4",null,7,79,79]
["VE4",null,7,80,80]
["VE4",null,7,84,84]
["VE4",null,7,89,89]
["VE5",null,7,3,3]
["VE5",null,7,14,14]
["VE5",null,7,20,20]
["VE5",null,7,26,26]
["VE5",null,7,31,31]
["VE5",null,7,36,36]
["VE5",null,7,39,39]
["VE5",null,7,43,43]
["VE5",null,7,50,50]
["VE5",null,7,59,59]
["VE5",null,7,67,67]
["VE5",null,7,79,79]
["VE5",null,7,89,89]
["NZ1",null,7,1,1]
["NZ1",null,7,6,6]
["NZ1",null,7,12,12]
["NZ1",null,7,17,17]
["NZ1",null,7,24,24]
["NZ1",null,7,37,37]
["NZ1",null,7,40,40]
["NZ1",null,7,50,50]
["NZ1",null,7,52,52]
["NZ1",null,7,53,53]
["NZ1",null,7,67,67]
["NZ1",null,7,79,79]
["NZ1",null,7,81,81]
["NZ1",null,7,89,89]
["NZ2",null,7,10,10]
["NZ2",null,7,46,46]
["NZ2",null,7,50,50]
["NZ2",null,7,54,54]
["NZ2",null,7,70,70]
["NZ2",null,7,71,71]
["NZ2",null,7,77,77]
["NZ2",null,7,81,81]
["NZ2",null,7,82,82]
["NZ2",null,7,86,86]
["NZ3",null,7,3,3]
["NZ3",null,7,11,{"$f":"IF(MOD(B2882+D2882,90),MOD(B2882+D2882,90),90)","v":11}]
["NZ3",null,7,19,19]
["NZ3",null,7,28,28]
["NZ3",null,7,31,31]
["NZ3",null,7,34,34]
["NZ3",null,7,36,36]
["NZ3",null,7,39,39]
["NZ3",null,7,45,45]
["NZ3",null,7,67,67]
["NZ3",null,7,72,72]
["NZ3",null,7,75,75]
["NZ3",null,7,85,85]
["NZ3",null,7,87,87]
["NZ4",null,7,5,5]
["NZ4",null,7,15,15]
["NZ4",null,7,17,17]
["NZ4",null,7,24,24]
["NZ4",null,7,32,32]
["NZ4",null,7,33,33]
["NZ4",null,7,36,36]
["NZ4",null,7,37,37]
["NZ4",null,7,40,40]
["NZ4",null,7,50,50]
["NZ4",null,7,53,53]
["NZ4",null,7,55,55]
["NZ4",null,7,61,61]
["NZ4",null,7,64,64]
["NZ4",null,7,65,65]
["NZ4",null,7,68,68]
["NZ4",null,7,73,73]
["NZ4",null,7,79,79]
["NZ4",null,7,81,81]
["NZ4",null,7,83,83]
["NZ4",null,7,87,87]
["NZ5",null,7,3,3]
["NZ5",null,7,6,6]
["NZ5",null,7,10,10]
["NZ5",null,7,11,11]
["NZ5",null,7,18,18]
["NZ5",null,7,47,47]
["NZ5",null,7,48,48]
["NZ5",null,7,55,55]
["NZ5",null,7,56,56]
["NZ5",null,7,60,60]
["NZ5",null,7,67,67]
["NZ5",null,7,73,73]
["NZ5",null,7,83,83]
["NZ5",null,7,85,85]
["BA1",null,8,14,14]
["BA1",null,8,40,40]
["BA1",null,8,53,53]
["BA1",null,8,55,55]
["BA1",null,8,67,67]
["BA1",null,8,75,75]
["BA1",null,8,79,79]
["BA1",null,8,84,84]
["BA1",null,8,85,85]
["BA1",null,8,90,90]
["BA2",null,8,4,4]
["BA2",null,8,8,8]
["BA2",null,8,15,15]
["BA2",null,8,29,29]
["BA2",null,8,37,37]
["BA2",null,8,42,42]
["BA2",null,8,56,{"$f":"IF(MOD(B2946+D2946,90),MOD(B2946+D2946,90),90)","v":56}]
["BA2",null,8,57,57]
["BA2",null,8,59,59]
["BA2",null,8,63,63]
["BA2",null,8,64,64]
["BA2",null,8,67,67]
["BA2",null,8,81,81]
["BA2",null,8,89,89]
["BA3",null,8,1,1]
["BA3",null,8,3,3]
["BA3",null,8,4,4]
["BA3",null,8,6,6]
["BA3",null,8,11,11]
["BA3",null,8,38,38]
["BA3",null,8,46,46]
["BA3",null,8,49,49]
["BA3",null,8,55,55]
["BA3",null,8,62,62]
["BA3",null,8,67,67]
["BA3",null,8,70,70]
["BA3",null,8,89,89]
["BA4",null,8,5,5]
["BA4",null,8,19,19]
["BA4",null,8,28,28]
["BA4",null,8,35,35]
["BA4",null,8,47,47]
["BA4",null,8,70,70]
["BA4",null,8,77,77]
["BA4",null,8,82,82]
["BA5",null,8,15,15]
["BA5",null,8,16,16]
["BA5",null,8,19,19]
["BA5",null,8,20,20]
["BA5",null,8,21,21]
["BA5",null,8,27,27]
["BA5",null,8,39,39]
["BA5",null,8,48,48]
["BA5",null,8,68,68]
["BA5",null,8,71,71]
["BA5",null,8,73,73]
["BA5",null,8,78,78]
["CA1",null,8,13,13]
["CA1",null,8,19,19]
["CA1",null,8,29,29]
["CA1",null,8,33,33]
["CA1",null,8,39,39]
["CA1",null,8,40,40]
["CA1",null,8,48,48]
["CA1",null,8,49,49]
["CA1",null,8,62,62]
["CA1",null,8,64,64]
["CA1",null,8,76,76]
["CA1",null,8,83,83]
["CA1",null,8,88,88]
["CA1",null,8,89,89]
["CA2",null,8,3,3]
["CA2",null,8,8,8]
["CA2",null,8,27,27]
["CA2",null,8,34,34]
["CA2",null,8,41,41]
["CA2",null,8,42,42]
["CA2",null,8,43,43]
["CA2",null,8,44,44]
["CA2",null,8,52,52]
["CA2",null,8,53,{"$f":"IF(MOD(B3010+D3010,90),MOD(B3010+D3010,90),90)","v":53}]
["CA2",null,8,58,58]
["CA2",null,8,69,69]
["CA2",null,8,74,74]
["CA2",null,8,88,88]
["CA2",null,8,89,89]
["CA3",null,8,9,9]
["CA3",null,8,42,42]
["CA3",null,8,56,56]
["CA3",null,8,62,62]
["CA3",null,8,75,75]
["CA4",null,8,1,1]
["CA4",null,8,4,4]
["CA4",null,8,13,13]
["CA4",null,8,19,19]
["CA4",null,8,23,23]
["CA4",null,8,25,25]
["CA4",null,8,39,39]
["CA4",null,8,54,54]
["CA4",null,8,68,68]
["CA4",null,8,72,72]
["CA4",null,8,80,80]
["CA4",null,8,83,83]
["CA5",null,8,3,3]
["CA5",null,8,4,4]
["CA5",null,8,10,10]
["CA5",null,8,11,11]
["CA5",null,8,12,12]
["CA5",null,8,18,18]
["CA5",null,8,26,26]
["CA5",null,8,33,33]
["CA5",null,8,42,42]
["CA5",null,8,55,55]
["CA5",null,8,72,72]
["CA5",null,8,73,73]
["CA5",null,8,78,78]
["CA5",null,8,80,80]
["CA5",null,8,83,83]
["CA5",null,8,84,84]
["FI1",null,8,4,4]
["FI1",null,8,13,13]
["FI1",null,8,15,15]
["FI1",null,8,18,18]
["FI1",null,8,42,42]
["FI1",null,8,45,45]
["FI1",null,8,52,52]
["FI1",null,8,68,68]
["FI1",null,8,73,73]
["FI1",null,8,74,74]
["FI1",null,8,87,87]
["FI2",null,8,14,14]
["FI2",null,8,21,21]
["FI2",null,8,37,37]
["FI2",null,8,39,39]
["FI2",null,8,40,40]
["FI2",null,8,56,56]
["FI2",null,8,58,58]
["FI2",null,8,61,61]
["FI2",null,8,62,62]
["FI2",null,8,64,64]
["FI2",null,8,66,66]
["FI2",null,8,74,74]
["FI2",null,8,77,77]
["FI2",null,8,83,83]
["FI3",null,8,14,{"$f":"IF(MOD(B3074+D3074,90),MOD(B3074+D3074,90),90)","v":14}]
["FI3",null,8,22,22]
["FI3",null,8,34,34]
["FI3",null,8,35,35]
["FI3",null,8,37,37]
["FI3",null,8,40,40]
["FI3",null,8,41,41]
["FI3",null,8,50,50]
["FI3",null,8,53,53]
["FI3",null,8,62,62]
["FI3",null,8,68,68]
["FI3",null,8,69,69]
["FI3",null,8,83,83]
["FI4",null,8,4,4]
["FI4",null,8,21,21]
["FI4",null,8,30,30]
["FI4",null,8,41,41]
["FI4",null,8,51,51]
["FI4",null,8,58,58]
["FI4",null,8,60,60]
["FI4",null,8,77,77]
["FI4",null,8,81,81]
["FI4",null,8,83,83]
["FI4",null,8,87,87]
["FI4",null,8,89,89]
["FI5",null,8,5,5]
["FI5",null,8,13,13]
["FI5",null,8,16,16]
["FI5",null,8,22,22]
["FI5",null,8,24,24]
["FI5",null,8,27,27]
["FI5",null,8,42,42]
["FI5",null,8,63,63]
["FI5",null,8,71,71]
["FI5",null,8,85,85]
["FI5",null,8,89,89]
["GE1",null,8,6,6]
["GE1",null,8,10,10]
["GE1",null,8,14,14]
["GE1",null,8,15,15]
["GE1",null,8,45,45]
["GE1",null,8,52,52]
["GE1",null,8,65,65]
["GE1",null,8,70,70]
["GE1",null,8,74,74]
["GE1",null,8,82,82]
["GE2",null,8,21,21]
["GE2",null,8,24,24]
["GE2",null,8,31,31]
["GE2",null,8,33,33]
["GE2",null,8,36,36]
["GE2",null,8,39,39]
["GE2",null,8,40,40]
["GE2",null,8,47,47]
["GE2",null,8,54,54]
["GE2",null,8,64,64]
["GE2",null,8,75,75]
["GE2",null,8,79,79]
["GE2",null,8,87,87]
["GE2",null,8,90,90]
["GE3",null,8,4,4]
["GE3",null,8,41,41]
["GE3",null,8,47,47]
["GE3",null,8,50,50]
["GE3",null,8,57,{"$f":"IF(MOD(B3138+D3138,90),MOD(B3138+D3138,90),90)","v":57}]
["GE3",null,8,72,72]
["GE3",null,8,76,76]
["GE3",null,8,77,77]
["GE3",null,8,86,86]
["GE4",null,8,3,3]
["GE4",null,8,25,25]
["GE4",null,8,29,29]
["GE4",null,8,37,37]
["GE4",null,8,48,48]
["GE4",null,8,58,58]
["GE4",null,8,65,65]
["GE4",null,8,71,71]
["GE4",null,8,74,74]
["GE4",null,8,78,78]
["GE4",null,8,84,84]
["GE5",null,8,6,6]
["GE5",null,8,10,10]
["GE5",null,8,18,18]
["GE5",null,8,25,25]
["GE5",null,8,32,32]
["GE5",null,8,50,50]
["GE5",null,8,54,54]
["GE5",null,8,56,56]
["GE5",null,8,60,60]
["GE5",null,8,61,61]
["GE5",null,8,82,82]
["GE5",null,8,90,90]
["MI1",null,8,1,1]
["MI1",null,8,7,7]
["MI1",null,8,24,24]
["MI1",null,8,40,40]
["MI1",null,8,44,44]
["MI1",null,8,48,48]
["MI1",null,8,66,66]
["MI1",null,8,85,85]
["MI2",null,8,3,3]
["MI2",null,8,5,5]
["MI2",null,8,29,29]
["MI2",null,8,50,50]
["MI2",null,8,54,54]
["MI2",null,8,62,62]
["MI2",null,8,64,64]
["MI3",null,8,1,1]
["MI3",null,8,11,11]
["MI3",null,8,15,15]
["MI3",null,8,23,23]
["MI3",null,8,24,24]
["MI3",null,8,40,40]
["MI3",null,8,54,54]
["MI3",null,8,58,58]
["MI3",null,8,66,66]
["MI3",null,8,78,78]
["MI3",null,8,86,86]
["MI4",null,8,1,1]
["MI4",null,8,2,2]
["MI4",null,8,13,13]
["MI4",null,8,27,27]
["MI4",null,8,30,30]
["MI4",null,8,32,32]
["MI4",null,8,70,70]
["MI5",null,8,6,6]
["MI5",null,8,9,9]
["MI5",null,8,19,19]
["MI5",null,8,20,{"$f":"IF(MOD(B3202+D3202,90),MOD(B3202+D3202,90),90)","v":20}]
["MI5",null,8,30,30]
["MI5",null,8,38,38]
["MI5",null,8,39,39]
["MI5",null,8,45,45]
["MI5",null,8,48,48]
["MI5",null,8,49,49]
["MI5",null,8,54,54]
["MI5",null,8,74,74]
["MI5",null,8,75,75]
["MI5",null,8,76,76]
["MI5",null,8,84,84]
["NA1",null,8,12,12]
["NA1",null,8,27,27]
["NA1",null,8,42,42]
["NA1",null,8,59,59]
["NA1",null,8,76,76]
["NA2",null,8,8,8]
["NA2",null,8,9,9]
["NA2",null,8,22,22]
["NA2",null,8,25,25]
["NA2",null,8,32,32]
["NA2",null,8,59,59]
["NA2",null,8,63,63]
["NA2",null,8,73,73]
["NA2",null,8,83,83]
["NA2",null,8,85,85]
["NA2",null,8,87,87]
["NA2",null,8,88,88]
["NA2",null,8,90,90]
["NA3",null,8,15,15]
["NA3",null,8,21,21]
["NA3",null,8,26,26]
["NA3",null,8,32,32]
["NA3",null,8,38,38]
["NA3",null,8,49,49]
["NA3",null,8,50,50]
["NA3",null,8,59,59]
["NA3",null,8,68,68]
["NA3",null,8,71,71]
["NA3",null,8,81,81]
["NA3",null,8,88,88]
["NA3",null,8,90,90]
["NA4",null,8,19,19]
["NA4",null,8,33,33]
["NA4",null,8,39,39]
["NA4",null,8,40,40]
["NA4",null,8,45,45]
["NA4",null,8,51,51]
["NA4",null,8,59,59]
["NA4",null,8,74,74]
["NA4",null,8,86,86]
["NA5",null,8,7,7]
["NA5",null,8,19,19]
["NA5",null,8,23,23]
["NA5",null,8,26,26]
["NA5",null,8,29,29]
["NA5",null,8,31,31]
["NA5",null,8,42,42]
["NA5",null,8,53,53]
["NA5",null,8,57,57]
["NA5",null,8,60,60]
["NA5",null,8,74,74]
["NA5",null,8,82,82]
["NA5",null,8,83,{"$f":"IF(MOD(B3266+D3266,90),MOD(B3266+D3266,90),90)","v":83}]
["PA1",null,8,3,3]
["PA1",null,8,7,7]
["PA1",null,8,11,11]
["PA1",null,8,13,13]
["PA1",null,8,14,14]
["PA1",null,8,16,16]
["PA1",null,8,18,18]
["PA1",null,8,20,20]
["PA1",null,8,34,34]
["PA1",null,8,36,36]
["PA1",null,8,38,38]
["PA1",null,8,40,40]
["PA1",null,8,42,42]
["PA1",null,8,49,49]
["PA1",null,8,63,63]
["PA1",null,8,68,68]
["PA1",null,8,76,76]
["PA1",null,8,79,79]
["PA2",null,8,1,1]
["PA2",null,8,2,2]
["PA2",null,8,6,6]
["PA2",null,8,11,11]
["PA2",null,8,15,15]
["PA2",null,8,26,26]
["PA2",null,8,37,37]
["PA2",null,8,38,38]
["PA2",null,8,50,50]
["PA2",null,8,56,56]
["PA2",null,8,66,66]
["PA2",null,8,70,70]
["PA2",null,8,72,72]
["PA2",null,8,81,81]
["PA2",null,8,86,86]
["PA2",null,8,89,89]
["PA3",null,8,3,3]
["PA3",null,8,4,4]
["PA3",null,8,6,6]
["PA3",null,8,20,20]
["PA3",null,8,22,22]
["PA3",null,8,23,23]
["PA3",null,8,24,24]
["PA3",null,8,25,25]
["PA3",null,8,27,27]
["PA3",null,8,30,30]
["PA3",null,8,31,31]
["PA3",null,8,39,39]
["PA3",null,8,62,62]
["PA3",null,8,63,63]
["PA3",null,8,71,71]
["PA3",null,8,76,76]
["PA3",null,8,87,87]
["PA3",null,8,88,88]
["PA4",null,8,28,28]
["PA4",null,8,31,31]
["PA4",null,8,46,46]
["PA4",null,8,49,49]
["PA4",null,8,56,56]
["PA4",null,8,72,72]
["PA4",null,8,87,87]
["PA5",null,8,1,1]
["PA5",null,8,6,6]
["PA5",null,8,8,8]
["PA5",null,8,15,15]
["PA5",null,8,17,{"$f":"IF(MOD(B3330+D3330,90),MOD(B3330+D3330,90),90)","v":17}]
["PA5",null,8,21,21]
["PA5",null,8,26,26]
["PA5",null,8,27,27]
["PA5",null,8,31,31]
["PA5",null,8,35,35]
["PA5",null,8,40,40]
["PA5",null,8,56,56]
["PA5",null,8,62,62]
["PA5",null,8,66,66]
["PA5",null,8,67,67]
["PA5",null,8,68,68]
["PA5",null,8,74,74]
["PA5",null,8,83,83]
["RO1",null,8,2,2]
["RO1",null,8,3,3]
["RO1",null,8,4,4]
["RO1",null,8,7,7]
["RO1",null,8,13,13]
["RO1",null,8,14,14]
["RO1",null,8,22,22]
["RO1",null,8,26,26]
["RO1",null,8,27,27]
["RO1",null,8,35,35]
["RO1",null,8,44,44]
["RO1",null,8,46,46]
["RO1",null,8,51,51]
["RO1",null,8,58,58]
["RO1",null,8,83,83]
["RO2",null,8,8,8]
["RO2",null,8,11,11]
["RO2",null,8,37,37]
["RO2",null,8,41,41]
["RO2",null,8,52,52]
["RO2",null,8,53,53]
["RO2",null,8,73,73]
["RO2",null,8,78,78]
["RO3",null,8,35,35]
["RO3",null,8,36,36]
["RO3",null,8,46,46]
["RO3",null,8,47,47]
["RO3",null,8,50,50]
["RO3",null,8,51,51]
["RO3",null,8,61,61]
["RO3",null,8,74,74]
["RO3",null,8,80,80]
["RO3",null,8,86,86]
["RO4",null,8,7,7]
["RO4",null,8,9,9]
["RO4",null,8,20,20]
["RO4",null,8,24,24]
["RO4",null,8,26,26]
["RO4",null,8,38,38]
["RO4",null,8,39,39]
["RO4",null,8,48,48]
["RO4",null,8,59,59]
["RO4",null,8,64,64]
["RO4",null,8,67,67]
["RO4",null,8,72,72]
["RO4",null,8,74,74]
["RO4",null,8,75,75]
["RO4",null,8,78,78]
["RO4",null,8,89,89]
["RO5",null,8,6,6]
["RO5",null,8,23,{"$f":"IF(MOD(B3394+D3394,90),MOD(B3394+D3394,90),90)","v":23}]
["RO5",null,8,25,25]
["RO5",null,8,45,45]
["RO5",null,8,66,66]
["RO5",null,8,77,77]
["RO5",null,8,78,78]
["RO5",null,8,79,79]
["RO5",null,8,85,85]
["TO1",null,8,2,2]
["TO1",null,8,5,5]
["TO1",null,8,7,7]
["TO1",null,8,10,10]
["TO1",null,8,11,11]
["TO1",null,8,13,13]
["TO1",null,8,20,20]
["TO1",null,8,36,36]
["TO1",null,8,39,39]
["TO1",null,8,41,41]
["TO1",null,8,46,46]
["TO1",null,8,53,53]
["TO1",null,8,55,55]
["TO1",null,8,59,59]
["TO1",null,8,76,76]
["TO1",null,8,77,77]
["TO1",null,8,82,82]
["TO1",null,8,89,89]
["TO2",null,8,1,1]
["TO2",null,8,4,4]
["TO2",null,8,5,5]
["TO2",null,8,6,6]
["TO2",null,8,20,20]
["TO2",null,8,28,28]
["TO2",null,8,38,38]
["TO2",null,8,41,41]
["TO2",null,8,47,47]
["TO2",null,8,61,61]
["TO2",null,8,82,82]
["TO2",null,8,84,84]
["TO3",null,8,6,6]
["TO3",null,8,17,17]
["TO3",null,8,27,27]
["TO3",null,8,34,34]
["TO3",null,8,42,42]
["TO3",null,8,43,43]
["TO3",null,8,45,45]
["TO3",null,8,48,48]
["TO3",null,8,50,50]
["TO3",null,8,57,57]
["TO3",null,8,64,64]
["TO3",null,8,68,68]
["TO4",null,8,2,2]
["TO4",null,8,9,9]
["TO4",null,8,18,18]
["TO4",null,8,36,36]
["TO4",null,8,39,39]
["TO4",null,8,44,44]
["TO4",null,8,48,48]
["TO4",null,8,60,60]
["TO4",null,8,62,62]
["TO4",null,8,64,64]
["TO4",null,8,71,71]
["TO4",null,8,74,74]
["TO4",null,8,87,87]
["TO5",null,8,6,6]
["TO5",null,8,34,{"$f":"IF(MOD(B3458+D3458,90),MOD(B3458+D3458,90),90)","v":34}]
["TO5",null,8,51,51]
["TO5",null,8,55,55]
["TO5",null,8,56,56]
["TO5",null,8,57,57]
["TO5",null,8,62,62]
["TO5",null,8,64,64]
["TO5",null,8,70,70]
["TO5",null,8,72,72]
["TO5",null,8,81,81]
["TO5",null,8,89,89]
["TO5",null,8,90,90]
["VE1",null,8,2,2]
["VE1",null,8,18,18]
["VE1",null,8,19,19]
["VE1",null,8,21,21]
["VE1",null,8,55,55]
["VE1",null,8,58,58]
["VE1",null,8,69,69]
["VE1",null,8,73,73]
["VE1",null,8,75,75]
["VE1",null,8,87,87]
["VE2",null,8,1,1]
["VE2",null,8,8,8]
["VE2",null,8,18,18]
["VE2",null,8,23,23]
["VE2",null,8,25,25]
["VE2",null,8,30,30]
["VE2",null,8,33,33]
["VE2",null,8,37,37]
["VE2",null,8,38,38]
["VE2",null,8,42,42]
["VE2",null,8,43,43]
["VE2",null,8,44,44]
["VE2",null,8,48,48]
["VE2",null,8,52,52]
["VE2",null,8,58,58]
["VE2",null,8,59,59]
["VE2",null,8,64,64]
["VE2",null,8,67,67]
["VE2",null,8,70,70]
["VE2",null,8,84,84]
["VE2",null,8,87,87]
["VE3",null,8,5,5]
["VE3",null,8,11,11]
["VE3",null,8,15,15]
["VE3",null,8,25,25]
["VE3",null,8,38,38]
["VE3",null,8,53,53]
["VE3",null,8,56,56]
["VE3",null,8,57,57]
["VE3",null,8,73,73]
["VE3",null,8,78,78]
["VE3",null,8,90,90]
["VE4",null,8,7,7]
["VE4",null,8,9,9]
["VE4",null,8,11,11]
["VE4",null,8,22,22]
["VE4",null,8,37,37]
["VE4",null,8,40,40]
["VE4",null,8,45,45]
["VE4",null,8,51,51]
["VE4",null,8,56,56]
["VE4",null,8,66,66]
["VE4",null,8,69,{"$f":"IF(MOD(B3522+D3522,90),MOD(B3522+D3522,90),90)","v":69}]
["VE4",null,8,70,70]
["VE4",null,8,77,77]
["VE4",null,8,87,87]
["VE5",null,8,19,19]
["VE5",null,8,38,38]
["VE5",null,8,44,44]
["VE5",null,8,60,60]
["VE5",null,8,62,62]
["VE5",null,8,64,64]
["VE5",null,8,75,75]
["VE5",null,8,80,80]
["NZ1",null,8,2,2]
["NZ1",null,8,3,3]
["NZ1",null,8,5,5]
["NZ1",null,8,7,7]
["NZ1",null,8,8,8]
["NZ1",null,8,14,14]
["NZ1",null,8,18,18]
["NZ1",null,8,25,25]
["NZ1",null,8,26,26]
["NZ1",null,8,33,33]
["NZ1",null,8,34,34]
["NZ1",null,8,36,36]
["NZ1",null,8,39,39]
["NZ1",null,8,42,42]
["NZ1",null,8,49,49]
["NZ1",null,8,51,51]
["NZ1",null,8,59,59]
["NZ1",null,8,60,60]
["NZ1",null,8,68,68]
["NZ1",null,8,72,72]
["NZ1",null,8,73,73]
["NZ1",null,8,74,74]
["NZ2",null,8,13,13]
["NZ2",null,8,14,14]
["NZ2",null,8,29,29]
["NZ2",null,8,48,48]
["NZ2",null,8,55,55]
["NZ2",null,8,60,60]
["NZ2",null,8,65,65]
["NZ2",null,8,73,73]
["NZ2",null,8,74,74]
["NZ2",null,8,75,75]
["NZ2",null,8,78,78]
["NZ2",null,8,87,87]
["NZ3",null,8,1,1]
["NZ3",null,8,12,12]
["NZ3",null,8,14,14]
["NZ3",null,8,27,27]
["NZ3",null,8,35,35]
["NZ3",null,8,38,38]
["NZ3",null,8,42,42]
["NZ3",null,8,47,47]
["NZ3",null,8,48,48]
["NZ3",null,8,56,56]
["NZ3",null,8,65,65]
["NZ3",null,8,68,68]
["NZ3",null,8,79,79]
["NZ3",null,8,84,84]
["NZ4",null,8,4,4]
["NZ4",null,8,11,11]
["NZ4",null,8,14,14]
["NZ4",null,8,16,16]
["NZ4",null,8,20,{"$f":"IF(MOD(B3586+D3586,90),MOD(B3586+D3586,90),90)","v":20}]
["NZ4",null,8,23,23]
["NZ4",null,8,35,35]
["NZ4",null,8,38,38]
["NZ4",null,8,46,46]
["NZ4",null,8,48,48]
["NZ4",null,8,62,62]
["NZ4",null,8,66,66]
["NZ4",null,8,85,85]
["NZ4",null,8,88,88]
["NZ4",null,8,89,89]
["NZ5",null,8,14,14]
["NZ5",null,8,25,25]
["NZ5",null,8,26,26]
["NZ5",null,8,28,28]
["NZ5",null,8,34,34]
["NZ5",null,8,43,43]
["NZ5",null,8,51,51]
["NZ5",null,8,62,62]
["NZ5",null,8,65,65]
["NZ5",null,8,71,71]
["NZ5",null,8,79,79]
["NZ5",null,8,82,82]
["NZ5",null,8,89,89]
["BA1",null,9,6,6]
["BA1",null,9,16,16]
["BA1",null,9,24,24]
["BA1",null,9,33,33]
["BA1",null,9,45,45]
["BA1",null,9,47,47]
["BA1",null,9,49,49]
["BA1",null,9,54,54]
["BA1",null,9,58,58]
["BA1",null,9,61,61]
["BA1",null,9,66,66]
["BA2",null,9,3,3]
["BA2",null,9,7,7]
["BA2",null,9,14,14]
["BA2",null,9,16,16]
["BA2",null,9,23,23]
["BA2",null,9,26,26]
["BA2",null,9,27,27]
["BA2",null,9,38,38]
["BA2",null,9,48,48]
["BA2",null,9,51,51]
["BA2",null,9,53,53]
["BA2",null,9,75,75]
["BA2",null,9,90,90]
["BA3",null,9,44,44]
["BA4",null,9,10,10]
["BA4",null,9,13,13]
["BA4",null,9,30,30]
["BA4",null,9,37,37]
["BA4",null,9,44,44]
["BA4",null,9,48,48]
["BA4",null,9,59,59]
["BA4",null,9,63,63]
["BA4",null,9,75,75]
["BA5",null,9,3,3]
["BA5",null,9,22,22]
["BA5",null,9,28,28]
["BA5",null,9,33,33]
["BA5",null,9,35,35]
["BA5",null,9,38,38]
["BA5",null,9,42,{"$f":"IF(MOD(B3650+D3650,90),MOD(B3650+D3650,90),90)","v":42}]
["BA5",null,9,72,72]
["BA5",null,9,82,82]
["CA1",null,9,2,2]
["CA1",null,9,5,5]
["CA1",null,9,9,9]
["CA1",null,9,11,11]
["CA1",null,9,15,15]
["CA1",null,9,31,31]
["CA1",null,9,44,44]
["CA1",null,9,60,60]
["CA1",null,9,66,66]
["CA1",null,9,74,74]
["CA1",null,9,77,77]
["CA2",null,9,1,1]
["CA2",null,9,18,18]
["CA2",null,9,26,26]
["CA2",null,9,39,39]
["CA2",null,9,63,63]
["CA2",null,9,75,75]
["CA2",null,9,78,78]
["CA2",null,9,82,82]
["CA3",null,9,7,7]
["CA3",null,9,25,25]
["CA3",null,9,32,32]
["CA3",null,9,37,37]
["CA3",null,9,44,44]
["CA3",null,9,47,47]
["CA3",null,9,81,81]
["CA3",null,9,83,83]
["CA4",null,9,2,2]
["CA4",null,9,15,15]
["CA4",null,9,17,17]
["CA4",null,9,20,20]
["CA4",null,9,34,34]
["CA4",null,9,37,37]
["CA4",null,9,43,43]
["CA4",null,9,56,56]
["CA4",null,9,58,58]
["CA4",null,9,71,71]
["CA4",null,9,89,89]
["CA5",null,9,25,25]
["CA5",null,9,36,36]
["CA5",null,9,38,38]
["CA5",null,9,41,41]
["CA5",null,9,61,61]
["CA5",null,9,74,74]
["CA5",null,9,81,81]
["CA5",null,9,90,90]
["FI1",null,9,11,11]
["FI1",null,9,30,30]
["FI1",null,9,46,46]
["FI1",null,9,59,59]
["FI1",null,9,60,60]
["FI1",null,9,65,65]
["FI1",null,9,70,70]
["FI2",null,9,2,2]
["FI2",null,9,7,7]
["FI2",null,9,11,11]
["FI2",null,9,20,20]
["FI2",null,9,24,24]
["FI2",null,9,30,30]
["FI2",null,9,44,44]
["FI2",null,9,49,49]
["FI2",null,9,60,{"$f":"IF(MOD(B3714+D3714,90),MOD(B3714+D3714,90),90)","v":60}]
["FI2",null,9,69,69]
["FI2",null,9,72,72]
["FI2",null,9,75,75]
["FI2",null,9,76,76]
["FI2",null,9,78,78]
["FI3",null,9,3,3]
["FI3",null,9,10,10]
["FI3",null,9,15,15]
["FI3",null,9,38,38]
["FI3",null,9,43,43]
["FI3",null,9,54,54]
["FI3",null,9,57,57]
["FI3",null,9,64,64]
["FI3",null,9,86,86]
["FI4",null,9,2,2]
["FI4",null,9,6,6]
["FI4",null,9,7,7]
["FI4",null,9,14,14]
["FI4",null,9,19,19]
["FI4",null,9,20,20]
["FI4",null,9,31,31]
["FI4",null,9,36,36]
["FI4",null,9,39,39]
["FI4",null,9,42,42]
["FI4",null,9,52,52]
["FI4",null,9,57,57]
["FI4",null,9,74,74]
["FI5",null,9,6,6]
["FI5",null,9,14,14]
["FI5",null,9,23,23]
["FI5",null,9,49,49]
["FI5",null,9,55,55]
["FI5",null,9,62,62]
["FI5",null,9,69,69]
["FI5",null,9,77,77]
["FI5",null,9,82,82]
["FI5",null,9,86,86]
["GE1",null,9,5,5]
["GE1",null,9,7,7]
["GE1",null,9,13,13]
["GE1",null,9,16,16]
["GE1",null,9,17,17]
["GE1",null,9,26,26]
["GE1",null,9,37,37]
["GE1",null,9,42,42]
["GE1",null,9,47,47]
["GE1",null,9,78,78]
["GE1",null,9,80,80]
["GE1",null,9,83,83]
["GE2",null,9,5,5]
["GE2",null,9,20,20]
["GE2",null,9,43,43]
["GE2",null,9,44,44]
["GE2",null,9,59,59]
["GE2",null,9,68,68]
["GE2",null,9,71,71]
["GE2",null,9,72,72]
["GE2",null,9,77,77]
["GE3",null,9,16,16]
["GE3",null,9,20,20]
["GE3",null,9,38,38]
["GE3",null,9,54,54]
["GE3",null,9,60,60]
["GE3",null,9,61,{"$f":"IF(MOD(B3778+D3778,90),MOD(B3778+D3778,90),90)","v":61}]
["GE3",null,9,62,62]
["GE3",null,9,66,66]
["GE3",null,9,71,71]
["GE3",null,9,73,73]
["GE4",null,9,11,11]
["GE4",null,9,22,22]
["GE4",null,9,31,31]
["GE4",null,9,50,50]
["GE4",null,9,69,69]
["GE4",null,9,75,75]
["GE5",null,9,8,8]
["GE5",null,9,51,51]
["GE5",null,9,68,68]
["GE5",null,9,76,76]
["MI1",null,9,11,11]
["MI1",null,9,14,14]
["MI1",null,9,17,17]
["MI1",null,9,61,61]
["MI1",null,9,63,63]
["MI1",null,9,70,70]
["MI1",null,9,76,76]
["MI2",null,9,10,10]
["MI2",null,9,11,11]
["MI2",null,9,16,16]
["MI2",null,9,19,19]
["MI2",null,9,46,46]
["MI2",null,9,47,47]
["MI2",null,9,48,48]
["MI2",null,9,59,59]
["MI2",null,9,73,73]
["MI2",null,9,75,75]
["MI3",null,9,5,5]
["MI3",null,9,21,21]
["MI3",null,9,26,26]
["MI3",null,9,31,31]
["MI3",null,9,61,61]
["MI3",null,9,67,67]
["MI3",null,9,81,81]
["MI3",null,9,89,89]
["MI4",null,9,11,11]
["MI4",null,9,37,37]
["MI4",null,9,85,85]
["MI5",null,9,10,10]
["MI5",null,9,11,11]
["MI5",null,9,18,18]
["MI5",null,9,31,31]
["MI5",null,9,50,50]
["MI5",null,9,53,53]
["MI5",null,9,58,58]
["MI5",null,9,59,59]
["MI5",null,9,62,62]
["MI5",null,9,88,88]
["MI5",null,9,90,90]
["NA1",null,9,7,7]
["NA1",null,9,22,22]
["NA1",null,9,28,28]
["NA1",null,9,30,30]
["NA1",null,9,53,53]
["NA1",null,9,72,72]
["NA1",null,9,73,73]
["NA1",null,9,83,83]
["NA1",null,9,86,86]
["NA1",null,9,90,90]
["NA2",null,9,18,{"$f":"IF(MOD(B3842+D3842,90),MOD(B3842+D3842,90),90)","v":18}]
["NA2",null,9,20,20]
["NA2",null,9,37,37]
["NA2",null,9,44,44]
["NA2",null,9,50,50]
["NA2",null,9,61,61]
["NA2",null,9,67,67]
["NA2",null,9,74,74]
["NA3",null,9,8,8]
["NA3",null,9,10,10]
["NA3",null,9,12,12]
["NA3",null,9,18,18]
["NA3",null,9,23,23]
["NA3",null,9,40,40]
["NA3",null,9,44,44]
["NA3",null,9,64,64]
["NA3",null,9,66,66]
["NA3",null,9,82,82]
["NA4",null,9,5,5]
["NA4",null,9,6,6]
["NA4",null,9,20,20]
["NA4",null,9,27,27]
["NA4",null,9,35,35]
["NA4",null,9,50,50]
["NA4",null,9,56,56]
["NA4",null,9,57,57]
["NA4",null,9,63,63]
["NA4",null,9,78,78]
["NA5",null,9,11,11]
["NA5",null,9,16,16]
["NA5",null,9,32,32]
["NA5",null,9,38,38]
["NA5",null,9,55,55]
["NA5",null,9,59,59]
["NA5",null,9,62,62]
["NA5",null,9,65,65]
["NA5",null,9,85,85]
["NA5",null,9,89,89]
["NA5",null,9,90,90]
["PA1",null,9,41,41]
["PA1",null,9,45,45]
["PA1",null,9,56,56]
["PA1",null,9,61,61]
["PA1",null,9,72,72]
["PA1",null,9,74,74]
["PA1",null,9,80,80]
["PA2",null,9,3,3]
["PA2",null,9,12,12]
["PA2",null,9,14,14]
["PA2",null,9,19,19]
["PA2",null,9,28,28]
["PA2",null,9,40,40]
["PA2",null,9,48,48]
["PA2",null,9,59,59]
["PA2",null,9,64,64]
["PA2",null,9,69,69]
["PA3",null,9,17,17]
["PA3",null,9,21,21]
["PA3",null,9,26,26]
["PA3",null,9,33,33]
["PA3",null,9,47,47]
["PA3",null,9,64,64]
["PA3",null,9,73,73]
["PA4",null,9,11,11]
["PA4",null,9,37,{"$f":"IF(MOD(B3906+D3906,90),MOD(B3906+D3906,90),90)","v":37}]
["PA4",null,9,39,39]
["PA4",null,9,45,45]
["PA4",null,9,53,53]
["PA4",null,9,66,66]
["PA4",null,9,68,68]
["PA4",null,9,80,80]
["PA4",null,9,82,82]
["PA4",null,9,84,84]
["PA4",null,9,86,86]
["PA5",null,9,20,20]
["PA5",null,9,23,23]
["PA5",null,9,39,39]
["PA5",null,9,63,63]
["PA5",null,9,72,72]
["PA5",null,9,88,88]
["RO1",null,9,29,29]
["RO1",null,9,31,31]
["RO1",null,9,36,36]
["RO1",null,9,38,38]
["RO1",null,9,45,45]
["RO1",null,9,67,67]
["RO1",null,9,74,74]
["RO1",null,9,79,79]
["RO2",null,9,25,25]
["RO2",null,9,44,44]
["RO2",null,9,49,49]
["RO2",null,9,64,64]
["RO2",null,9,70,70]
["RO2",null,9,71,71]
["RO2",null,9,75,75]
["RO2",null,9,84,84]
["RO2",null,9,88,88]
["RO2",null,9,89,89]
["RO3",null,9,3,3]
["RO3",null,9,16,16]
["RO3",null,9,19,19]
["RO3",null,9,28,28]
["RO3",null,9,49,49]
["RO3",null,9,52,52]
["RO3",null,9,54,54]
["RO3",null,9,67,67]
["RO3",null,9,69,69]
["RO3",null,9,82,82]
["RO3",null,9,83,83]
["RO3",null,9,89,89]
["RO4",null,9,4,4]
["RO4",null,9,5,5]
["RO4",null,9,8,8]
["RO4",null,9,23,23]
["RO4",null,9,27,27]
["RO4",null,9,55,55]
["RO4",null,9,69,69]
["RO5",null,9,5,5]
["RO5",null,9,7,7]
["RO5",null,9,20,20]
["RO5",null,9,22,22]
["RO5",null,9,31,31]
["RO5",null,9,46,46]
["RO5",null,9,48,48]
["RO5",null,9,51,51]
["RO5",null,9,57,57]
["RO5",null,9,58,58]
["RO5",null,9,69,69]
["RO5",null,9,88,{"$f":"IF(MOD(B3970+D3970,90),MOD(B3970+D3970,90),90)","v":88}]
["TO1",null,9,16,16]
["TO1",null,9,29,29]
["TO1",null,9,33,33]
["TO1",null,9,52,52]
["TO1",null,9,61,61]
["TO1",null,9,62,62]
["TO1",null,9,69,69]
["TO1",null,9,73,73]
["TO1",null,9,83,83]
["TO2",null,9,19,19]
["TO2",null,9,74,74]
["TO2",null,9,81,81]
["TO3",null,9,1,1]
["TO3",null,9,11,11]
["TO3",null,9,13,13]
["TO3",null,9,32,32]
["TO3",null,9,44,44]
["TO3",null,9,49,49]
["TO3",null,9,52,52]
["TO3",null,9,61,61]
["TO3",null,9,81,81]
["TO4",null,9,5,5]
["TO4",null,9,16,16]
["TO4",null,9,19,19]
["TO4",null,9,20,20]
["TO4",null,9,45,45]
["TO4",null,9,65,65]
["TO4",null,9,80,80]
["TO4",null,9,85,85]
["TO5",null,9,1,1]
["TO5",null,9,3,3]
["TO5",null,9,4,4]
["TO5",null,9,7,7]
["TO5",null,9,11,11]
["TO5",null,9,13,13]
["TO5",null,9,16,16]
["TO5",null,9,25,25]
["TO5",null,9,37,37]
["TO5",null,9,43,43]
["TO5",null,9,48,48]
["TO5",null,9,50,50]
["TO5",null,9,61,61]
["VE1",null,9,3,3]
["VE1",null,9,11,11]
["VE1",null,9,12,12]
["VE1",null,9,20,20]
["VE1",null,9,23,23]
["VE1",null,9,25,25]
["VE1",null,9,38,38]
["VE1",null,9,56,56]
["VE1",null,9,59,59]
["VE1",null,9,88,88]
["VE2",null,9,27,27]
["VE2",null,9,50,50]
["VE2",null,9,74,74]
["VE2",null,9,82,82]
["VE2",null,9,88,88]
["VE3",null,9,1,1]
["VE3",null,9,8,8]
["VE3",null,9,29,29]
["VE3",null,9,32,32]
["VE3",null,9,43,43]
["VE3",null,9,52,52]
["VE3",null,9,58,{"$f":"IF(MOD(B4034+D4034,90),MOD(B4034+D4034,90),90)","v":58}]
["VE3",null,9,62,62]
["VE3",null,9,64,64]
["VE3",null,9,85,85]
["VE4",null,9,1,1]
["VE4",null,9,18,18]
["VE4",null,9,19,19]
["VE4",null,9,20,20]
["VE4",null,9,28,28]
["VE4",null,9,32,32]
["VE4",null,9,33,33]
["VE4",null,9,39,39]
["VE4",null,9,44,44]
["VE4",null,9,46,46]
["VE4",null,9,47,47]
["VE4",null,9,86,86]
["VE4",null,9,88,88]
["VE5",null,9,8,8]
["VE5",null,9,11,11]
["VE5",null,9,13,13]
["VE5",null,9,16,16]
["VE5",null,9,40,40]
["VE5",null,9,45,45]
["VE5",null,9,47,47]
["VE5",null,9,70,70]
["VE5",null,9,85,85]
["NZ1",null,9,27,27]
["NZ1",null,9,41,41]
["NZ1",null,9,45,45]
["NZ1",null,9,56,56]
["NZ1",null,9,57,57]
["NZ1",null,9,63,63]
["NZ1",null,9,76,76]
["NZ1",null,9,82,82]
["NZ1",null,9,85,85]
["NZ2",null,9,1,1]
["NZ2",null,9,5,5]
["NZ2",null,9,20,20]
["NZ2",null,9,22,22]
["NZ2",null,9,33,33]
["NZ2",null,9,34,34]
["NZ2",null,9,39,39]
["NZ2",null,9,45,45]
["NZ2",null,9,47,47]
["NZ2",null,9,49,49]
["NZ2",null,9,53,53]
["NZ2",null,9,80,80]
["NZ3",null,9,4,4]
["NZ3",null,9,9,9]
["NZ3",null,9,29,29]
["NZ3",null,9,40,40]
["NZ3",null,9,41,41]
["NZ3",null,9,52,52]
["NZ3",null,9,59,59]
["NZ3",null,9,63,63]
["NZ3",null,9,74,74]
["NZ3",null,9,76,76]
["NZ3",null,9,80,80]
["NZ3",null,9,86,86]
["NZ3",null,9,90,90]
["NZ4",null,9,7,7]
["NZ4",null,9,10,10]
["NZ4",null,9,39,39]
["NZ4",null,9,47,47]
["NZ4",null,9,51,{"$f":"IF(MOD(B4098+D4098,90),MOD(B4098+D4098,90),90)","v":51}]
["NZ4",null,9,70,70]
["NZ5",null,9,2,2]
["NZ5",null,9,17,17]
["NZ5",null,9,20,20]
["NZ5",null,9,21,21]
["NZ5",null,9,27,27]
["NZ5",null,9,35,35]
["NZ5",null,9,37,37]
["NZ5",null,9,38,38]
["NZ5",null,9,53,53]
["NZ5",null,9,59,59]
["NZ5",null,9,61,61]
["NZ5",null,9,70,70]
["NZ5",null,9,76,76]
["BA1",null,10,20,20]
["BA1",null,10,35,35]
["BA1",null,10,41,41]
["BA1",null,10,44,44]
["BA1",null,10,48,48]
["BA1",null,10,87,87]
["BA2",null,10,1,1]
["BA2",null,10,11,11]
["BA2",null,10,44,44]
["BA2",null,10,45,45]
["BA2",null,10,55,55]
["BA2",null,10,69,69]
["BA3",null,10,2,2]
["BA3",null,10,20,20]
["BA3",null,10,32,32]
["BA3",null,10,35,35]
["BA3",null,10,61,61]
["BA3",null,10,72,72]
["BA3",null,10,81,81]
["BA4",null,10,2,2]
["BA4",null,10,3,3]
["BA4",null,10,4,4]
["BA4",null,10,16,16]
["BA4",null,10,29,29]
["BA4",null,10,31,31]
["BA4",null,10,66,66]
["BA4",null,10,69,69]
["BA4",null,10,90,90]
["BA5",null,10,1,1]
["BA5",null,10,4,4]
["BA5",null,10,7,7]
["BA5",null,10,9,9]
["BA5",null,10,55,55]
["BA5",null,10,66,66]
["BA5",null,10,84,84]
["CA1",null,10,4,4]
["CA1",null,10,20,20]
["CA1",null,10,25,25]
["CA1",null,10,53,53]
["CA2",null,10,15,15]
["CA2",null,10,25,25]
["CA2",null,10,32,32]
["CA2",null,10,70,70]
["CA2",null,10,71,71]
["CA3",null,10,11,11]
["CA3",null,10,13,13]
["CA3",null,10,28,28]
["CA3",null,10,34,34]
["CA3",null,10,50,50]
["CA3",null,10,52,{"$f":"IF(MOD(B4162+D4162,90),MOD(B4162+D4162,90),90)","v":52}]
["CA3",null,10,69,69]
["CA3",null,10,82,82]
["CA3",null,10,86,86]
["CA4",null,10,21,21]
["CA4",null,10,22,22]
["CA4",null,10,42,42]
["CA4",null,10,48,48]
["CA4",null,10,49,49]
["CA4",null,10,64,64]
["CA4",null,10,65,65]
["CA4",null,10,66,66]
["CA5",null,10,46,46]
["CA5",null,10,49,49]
["CA5",null,10,60,60]
["CA5",null,10,82,82]
["CA5",null,10,86,86]
["FI1",null,10,7,7]
["FI1",null,10,19,19]
["FI1",null,10,31,31]
["FI1",null,10,51,51]
["FI1",null,10,55,55]
["FI2",null,10,29,29]
["FI2",null,10,34,34]
["FI2",null,10,67,67]
["FI2",null,10,80,80]
["FI2",null,10,84,84]
["FI3",null,10,11,11]
["FI3",null,10,23,23]
["FI3",null,10,31,31]
["FI3",null,10,36,36]
["FI3",null,10,60,60]
["FI3",null,10,65,65]
["FI3",null,10,73,73]
["FI3",null,10,80,80]
["FI4",null,10,26,26]
["FI4",null,10,53,53]
["FI4",null,10,54,54]
["FI4",null,10,61,61]
["FI4",null,10,69,69]
["FI5",null,10,2,2]
["FI5",null,10,7,7]
["FI5",null,10,18,18]
["FI5",null,10,29,29]
["FI5",null,10,35,35]
["FI5",null,10,47,47]
["FI5",null,10,66,66]
["FI5",null,10,72,72]
["FI5",null,10,75,75]
["FI5",null,10,78,78]
["GE1",null,10,2,2]
["GE1",null,10,3,3]
["GE1",null,10,8,8]
["GE1",null,10,18,18]
["GE1",null,10,22,22]
["GE1",null,10,40,40]
["GE1",null,10,43,43]
["GE1",null,10,44,44]
["GE1",null,10,60,60]
["GE1",null,10,77,77]
["GE1",null,10,89,89]
["GE2",null,10,8,8]
["GE2",null,10,18,18]
["GE2",null,10,30,30]
["GE2",null,10,74,{"$f":"IF(MOD(B4226+D4226,90),MOD(B4226+D4226,90),90)","v":74}]
["GE2",null,10,84,84]
["GE3",null,10,2,2]
["GE3",null,10,17,17]
["GE3",null,10,27,27]
["GE3",null,10,29,29]
["GE3",null,10,34,34]
["GE3",null,10,63,63]
["GE3",null,10,83,83]
["GE4",null,10,9,9]
["GE4",null,10,15,15]
["GE4",null,10,30,30]
["GE4",null,10,33,33]
["GE4",null,10,35,35]
["GE4",null,10,40,40]
["GE4",null,10,51,51]
["GE4",null,10,56,56]
["GE4",null,10,63,63]
["GE4",null,10,70,70]
["GE4",null,10,77,77]
["GE4",null,10,79,79]
["GE5",null,10,2,2]
["GE5",null,10,5,5]
["GE5",null,10,39,39]
["GE5",null,10,53,53]
["GE5",null,10,75,75]
["GE5",null,10,84,84]
["GE5",null,10,86,86]
["GE5",null,10,87,87]
["MI1",null,10,12,12]
["MI1",null,10,21,21]
["MI1",null,10,27,27]
["MI1",null,10,33,33]
["MI1",null,10,35,35]
["MI1",null,10,50,50]
["MI1",null,10,80,80]
["MI2",null,10,1,1]
["MI2",null,10,23,23]
["MI2",null,10,24,24]
["MI2",null,10,35,35]
["MI2",null,10,36,36]
["MI2",null,10,45,45]
["MI2",null,10,61,61]
["MI2",null,10,63,63]
["MI3",null,10,25,25]
["MI3",null,10,39,39]
["MI3",null,10,44,44]
["MI3",null,10,45,45]
["MI3",null,10,57,57]
["MI3",null,10,72,72]
["MI3",null,10,88,88]
["MI4",null,10,8,8]
["MI4",null,10,9,9]
["MI4",null,10,23,23]
["MI4",null,10,24,24]
["MI4",null,10,33,33]
["MI4",null,10,40,40]
["MI4",null,10,45,45]
["MI4",null,10,57,57]
["MI4",null,10,60,60]
["MI4",null,10,77,77]
["MI4",null,10,87,87]
["MI5",null,10,15,15]
["MI5",null,10,17,17]
["MI5",null,10,28,{"$f":"IF(MOD(B4290+D4290,90),MOD(B4290+D4290,90),90)","v":28}]
["MI5",null,10,41,41]
["MI5",null,10,89,89]
["NA1",null,10,6,6]
["NA1",null,10,9,9]
["NA1",null,10,16,16]
["NA1",null,10,18,18]
["NA1",null,10,39,39]
["NA1",null,10,48,48]
["NA1",null,10,50,50]
["NA1",null,10,61,61]
["NA1",null,10,63,63]
["NA1",null,10,79,79]
["NA2",null,10,56,56]
["NA2",null,10,66,66]
["NA2",null,10,72,72]
["NA3",null,10,41,41]
["NA3",null,10,52,52]
["NA3",null,10,53,53]
["NA3",null,10,60,60]
["NA3",null,10,62,62]
["NA3",null,10,69,69]
["NA4",null,10,25,25]
["NA4",null,10,26,26]
["NA4",null,10,30,30]
["NA4",null,10,32,32]
["NA4",null,10,41,41]
["NA4",null,10,46,46]
["NA4",null,10,58,58]
["NA4",null,10,70,70]
["NA4",null,10,72,72]
["NA4",null,10,75,75]
["NA4",null,10,84,84]
["NA5",null,10,10,10]
["NA5",null,10,20,20]
["NA5",null,10,36,36]
["NA5",null,10,52,52]
["NA5",null,10,75,75]
["PA1",null,10,21,21]
["PA1",null,10,67,67]
["PA1",null,10,83,83]
["PA1",null,10,88,88]
["PA2",null,10,7,7]
["PA2",null,10,24,24]
["PA2",null,10,39,39]
["PA2",null,10,47,47]
["PA2",null,10,55,55]
["PA2",null,10,75,75]
["PA2",null,10,79,79]
["PA2",null,10,88,88]
["PA2",null,10,90,90]
["PA3",null,10,8,8]
["PA3",null,10,16,16]
["PA3",null,10,29,29]
["PA3",null,10,37,37]
["PA3",null,10,85,85]
["PA4",null,10,20,20]
["PA4",null,10,23,23]
["PA4",null,10,29,29]
["PA4",null,10,38,38]
["PA4",null,10,63,63]
["PA5",null,10,11,11]
["PA5",null,10,12,12]
["PA5",null,10,16,16]
["PA5",null,10,28,{"$f":"IF(MOD(B4354+D4354,90),MOD(B4354+D4354,90),90)","v":28}]
["PA5",null,10,41,41]
["PA5",null,10,47,47]
["PA5",null,10,52,52]
["PA5",null,10,77,77]
["RO1",null,10,5,5]
["RO1",null,10,15,15]
["RO1",null,10,20,20]
["RO1",null,10,40,40]
["RO1",null,10,64,64]
["RO1",null,10,72,72]
["RO1",null,10,82,82]
["RO1",null,10,87,87]
["RO2",null,10,40,40]
["RO2",null,10,48,48]
["RO2",null,10,61,61]
["RO2",null,10,65,65]
["RO2",null,10,74,74]
["RO2",null,10,79,79]
["RO2",null,10,82,82]
["RO3",null,10,6,6]
["RO3",null,10,9,9]
["RO3",null,10,12,12]
["RO3",null,10,39,39]
["RO3",null,10,64,64]
["RO3",null,10,76,76]
["RO3",null,10,88,88]
["RO3",null,10,90,90]
["RO4",null,10,6,6]
["RO4",null,10,25,25]
["RO4",null,10,57,57]
["RO4",null,10,60,60]
["RO4",null,10,63,63]
["RO4",null,10,68,68]
["RO4",null,10,81,81]
["RO5",null,10,2,2]
["RO5",null,10,8,8]
["RO5",null,10,34,34]
["RO5",null,10,40,40]
["RO5",null,10,60,60]
["RO5",null,10,65,65]
["TO1",null,10,14,14]
["TO1",null,10,50,50]
["TO1",null,10,78,78]
["TO1",null,10,87,87]
["TO2",null,10,14,14]
["TO2",null,10,24,24]
["TO2",null,10,29,29]
["TO2",null,10,33,33]
["TO2",null,10,34,34]
["TO2",null,10,40,40]
["TO2",null,10,46,46]
["TO2",null,10,59,59]
["TO2",null,10,76,76]
["TO2",null,10,89,89]
["TO2",null,10,90,90]
["TO3",null,10,10,10]
["TO3",null,10,25,25]
["TO3",null,10,33,33]
["TO3",null,10,36,36]
["TO3",null,10,37,37]
["TO3",null,10,47,47]
["TO3",null,10,70,70]
["TO3",null,10,86,86]
["TO4",null,10,1,{"$f":"IF(MOD(B4418+D4418,90),MOD(B4418+D4418,90),90)","v":1}]
["TO4",null,10,10,10]
["TO4",null,10,14,14]
["TO4",null,10,17,17]
["TO4",null,10,30,30]
["TO4",null,10,84,84]
["TO5",null,10,44,44]
["VE1",null,10,6,6]
["VE1",null,10,27,27]
["VE1",null,10,37,37]
["VE1",null,10,40,40]
["VE1",null,10,62,62]
["VE1",null,10,65,65]
["VE1",null,10,66,66]
["VE1",null,10,70,70]
["VE1",null,10,79,79]
["VE2",null,10,20,20]
["VE2",null,10,36,36]
["VE2",null,10,81,81]
["VE2",null,10,90,90]
["VE3",null,10,4,4]
["VE3",null,10,13,13]
["VE3",null,10,24,24]
["VE3",null,10,34,34]
["VE3",null,10,36,36]
["VE3",null,10,40,40]
["VE3",null,10,49,49]
["VE4",null,10,8,8]
["VE4",null,10,10,10]
["VE4",null,10,23,23]
["VE4",null,10,34,34]
["VE4",null,10,36,36]
["VE4",null,10,50,50]
["VE4",null,10,58,58]
["VE4",null,10,67,67]
["VE5",null,10,9,9]
["VE5",null,10,10,10]
["VE5",null,10,15,15]
["VE5",null,10,18,18]
["VE5",null,10,49,49]
["VE5",null,10,56,56]
["VE5",null,10,83,83]
["NZ1",null,10,15,15]
["NZ1",null,10,29,29]
["NZ1",null,10,44,44]
["NZ1",null,10,65,65]
["NZ2",null,10,38,38]
["NZ2",null,10,44,44]
["NZ2",null,10,64,64]
["NZ2",null,10,72,72]
["NZ3",null,10,37,37]
["NZ3",null,10,57,57]
["NZ3",null,10,60,60]
["NZ3",null,10,70,70]
["NZ4",null,10,27,27]
["NZ4",null,10,49,49]
["NZ4",null,10,52,52]
["NZ4",null,10,60,60]
["NZ4",null,10,84,84]
["NZ5",null,10,15,15]
["NZ5",null,10,19,19]
["NZ5",null,10,29,29]
["NZ5",null,10,36,36]
["NZ5",null,10,40,40]
["NZ5",null,10,42,{"$f":"IF(MOD(B4482+D4482,90),MOD(B4482+D4482,90),90)","v":42}]
["NZ5",null,10,50,50]
["NZ5",null,10,58,58]
["NZ5",null,10,68,68]
["NZ5",null,10,88,88]
["BA1",null,11,11,11]
["BA1",null,11,28,28]
["BA1",null,11,37,37]
["BA1",null,11,39,39]
["BA1",null,11,42,42]
["BA1",null,11,74,74]
["BA1",null,11,89,89]
["BA3",null,11,15,15]
["BA3",null,11,19,19]
["BA3",null,11,22,22]
["BA3",null,11,37,37]
["BA3",null,11,51,51]
["BA3",null,11,52,52]
["BA3",null,11,58,58]
["BA3",null,11,59,59]
["BA3",null,11,74,74]
["BA3",null,11,75,75]
["BA4",null,11,11,11]
["BA4",null,11,14,14]
["BA4",null,11,27,27]
["BA4",null,11,42,42]
["BA4",null,11,56,56]
["BA4",null,11,72,72]
["BA4",null,11,73,73]
["BA5",null,11,13,13]
["BA5",null,11,52,52]
["BA5",null,11,56,56]
["BA5",null,11,61,61]
["CA1",null,11,6,6]
["CA1",null,11,8,8]
["CA1",null,11,10,10]
["CA1",null,11,14,14]
["CA1",null,11,41,41]
["CA2",null,11,12,12]
["CA2",null,11,24,24]
["CA2",null,11,29,29]
["CA2",null,11,46,46]
["CA2",null,11,50,50]
["CA2",null,11,86,86]
["CA3",null,11,17,17]
["CA3",null,11,33,33]
["CA3",null,11,41,41]
["CA3",null,11,63,63]
["CA3",null,11,66,66]
["CA3",null,11,77,77]
["CA4",null,11,31,31]
["CA4",null,11,36,36]
["CA4",null,11,55,55]
["CA4",null,11,73,73]
["CA5",null,11,17,17]
["CA5",null,11,23,23]
["CA5",null,11,39,39]
["CA5",null,11,76,76]
["CA5",null,11,87,87]
["FI1",null,11,9,9]
["FI1",null,11,37,37]
["FI1",null,11,75,75]
["FI1",null,11,81,81]
["FI1",null,11,83,83]
["FI2",null,11,15,{"$f":"IF(MOD(B4546+D4546,90),MOD(B4546+D4546,90),90)","v":15}]
["FI2",null,11,17,17]
["FI2",null,11,55,55]
["FI2",null,11,65,65]
["FI3",null,11,2,2]
["FI3",null,11,70,70]
["FI4",null,11,29,29]
["FI4",null,11,38,38]
["FI5",null,11,41,41]
["FI5",null,11,45,45]
["FI5",null,11,73,73]
["GE1",null,11,50,50]
["GE1",null,11,55,55]
["GE2",null,11,46,46]
["GE2",null,11,61,61]
["GE2",null,11,62,62]
["GE3",null,11,24,24]
["GE3",null,11,35,35]
["GE3",null,11,78,78]
["GE4",null,11,38,38]
["GE4",null,11,41,41]
["GE4",null,11,76,76]
["GE5",null,11,14,14]
["GE5",null,11,16,16]
["GE5",null,11,17,17]
["GE5",null,11,36,36]
["GE5",null,11,41,41]
["GE5",null,11,67,67]
["MI1",null,11,3,3]
["MI1",null,11,6,6]
["MI1",null,11,42,42]
["MI1",null,11,87,87]
["MI1",null,11,88,88]
["MI2",null,11,2,2]
["MI2",null,11,20,20]
["MI2",null,11,33,33]
["MI3",null,11,12,12]
["MI3",null,11,62,62]
["MI3",null,11,90,90]
["MI4",null,11,29,29]
["MI4",null,11,52,52]
["MI4",null,11,80,80]
["MI4",null,11,84,84]
["MI5",null,11,7,7]
["MI5",null,11,33,33]
["MI5",null,11,52,52]
["MI5",null,11,68,68]
["MI5",null,11,79,79]
["MI5",null,11,83,83]
["NA1",null,11,62,62]
["NA1",null,11,85,85]
["NA2",null,11,11,11]
["NA2",null,11,51,51]
["NA2",null,11,53,53]
["NA2",null,11,70,70]
["NA3",null,11,19,19]
["NA3",null,11,75,75]
["NA3",null,11,80,80]
["NA3",null,11,87,87]
["NA4",null,11,48,48]
["NA4",null,11,66,66]
["NA5",null,11,6,6]
["NA5",null,11,37,37]
["NA5",null,11,69,69]
["NA5",null,11,71,{"$f":"IF(MOD(B4610+D4610,90),MOD(B4610+D4610,90),90)","v":71}]
["PA1",null,11,5,5]
["PA1",null,11,33,33]
["PA1",null,11,35,35]
["PA1",null,11,47,47]
["PA1",null,11,52,52]
["PA1",null,11,62,62]
["PA1",null,11,73,73]
["PA1",null,11,84,84]
["PA2",null,11,18,18]
["PA2",null,11,46,46]
["PA2",null,11,58,58]
["PA2",null,11,65,65]
["PA3",null,11,18,18]
["PA3",null,11,44,44]
["PA3",null,11,50,50]
["PA3",null,11,74,74]
["PA4",null,11,15,15]
["PA4",null,11,22,22]
["PA4",null,11,34,34]
["PA4",null,11,73,73]
["PA4",null,11,77,77]
["PA4",null,11,85,85]
["PA4",null,11,88,88]
["PA5",null,11,33,33]
["PA5",null,11,43,43]
["PA5",null,11,81,81]
["RO1",null,11,49,49]
["RO1",null,11,53,53]
["RO1",null,11,54,54]
["RO1",null,11,63,63]
["RO1",null,11,66,66]
["RO1",null,11,70,70]
["RO1",null,11,85,85]
["RO2",null,11,4,4]
["RO2",null,11,9,9]
["RO2",null,11,23,23]
["RO2",null,11,33,33]
["RO2",null,11,55,55]
["RO2",null,11,58,58]
["RO2",null,11,85,85]
["RO3",null,11,2,2]
["RO3",null,11,42,42]
["RO3",null,11,43,43]
["RO3",null,11,44,44]
["RO3",null,11,70,70]
["RO3",null,11,71,71]
["RO4",null,11,53,53]
["RO4",null,11,61,61]
["RO5",null,11,10,10]
["RO5",null,11,15,15]
["RO5",null,11,19,19]
["RO5",null,11,26,26]
["TO1",null,11,17,17]
["TO1",null,11,72,72]
["TO2",null,11,11,11]
["TO2",null,11,17,17]
["TO2",null,11,44,44]
["TO2",null,11,49,49]
["TO2",null,11,63,63]
["TO2",null,11,78,78]
["TO3",null,11,35,35]
["TO3",null,11,51,51]
["TO4",null,11,61,61]
["TO4",null,11,86,{"$f":"IF(MOD(B4674+D4674,90),MOD(B4674+D4674,90),90)","v":86}]
["TO4",null,11,88,88]
["TO5",null,11,21,21]
["TO5",null,11,28,28]
["TO5",null,11,38,38]
["TO5",null,11,42,42]
["TO5",null,11,53,53]
["TO5",null,11,66,66]
["TO5",null,11,71,71]
["VE1",null,11,5,5]
["VE1",null,11,78,78]
["VE1",null,11,80,80]
["VE2",null,11,68,68]
["VE2",null,11,75,75]
["VE2",null,11,85,85]
["VE3",null,11,16,16]
["VE3",null,11,22,22]
["VE3",null,11,28,28]
["VE3",null,11,74,74]
["VE4",null,11,5,5]
["VE4",null,11,57,57]
["VE4",null,11,68,68]
["VE5",null,11,12,12]
["VE5",null,11,27,27]
["VE5",null,11,55,55]
["NZ1",null,11,38,38]
["NZ2",null,11,21,21]
["NZ2",null,11,25,25]
["NZ2",null,11,68,68]
["NZ2",null,11,69,69]
["NZ2",null,11,85,85]
["NZ3",null,11,46,46]
["NZ3",null,11,53,53]
["NZ3",null,11,55,55]
["NZ3",null,11,62,62]
["NZ3",null,11,77,77]
["NZ4",null,11,18,18]
["NZ4",null,11,25,25]
["NZ4",null,11,30,30]
["NZ4",null,11,54,54]
["NZ4",null,11,77,77]
["NZ5",null,11,52,52]
["NZ5",null,11,75,75]
["BA1",null,12,23,23]
["BA2",null,12,70,70]
["BA2",null,12,85,85]
["BA3",null,12,21,21]
["BA3",null,12,31,31]
["BA3",null,12,85,85]
["BA4",null,12,43,43]
["BA4",null,12,64,64]
["BA5",null,12,14,14]
["BA5",null,12,60,60]
["CA1",null,12,26,26]
["CA1",null,12,54,54]
["CA1",null,12,72,72]
["CA2",null,12,6,6]
["CA2",null,12,80,80]
["CA2",null,12,87,87]
["CA3",null,12,8,8]
["CA3",null,12,55,55]
["CA4",null,12,77,77]
["CA5",null,12,5,5]
["CA5",null,12,9,9]
["CA5",null,12,54,{"$f":"IF(MOD(B4738+D4738,90),MOD(B4738+D4738,90),90)","v":54}]
["FI1",null,12,16,16]
["FI1",null,12,88,88]
["FI2",null,12,19,19]
["FI3",null,12,47,47]
["FI3",null,12,84,84]
["FI3",null,12,85,85]
["FI4",null,12,84,84]
["FI5",null,12,50,50]
["GE1",null,12,68,68]
["GE2",null,12,2,2]
["GE2",null,12,7,7]
["GE2",null,12,10,10]
["GE2",null,12,45,45]
["GE2",null,12,73,73]
["GE2",null,12,85,85]
["GE3",null,12,37,37]
["GE3",null,12,53,53]
["GE3",null,12,82,82]
["GE4",null,12,6,6]
["GE4",null,12,19,19]
["GE5",null,12,35,35]
["GE5",null,12,58,58]
["GE5",null,12,62,62]
["MI1",null,12,34,34]
["MI1",null,12,64,64]
["MI1",null,12,81,81]
["MI1",null,12,84,84]
["MI2",null,12,7,7]
["MI2",null,12,8,8]
["MI2",null,12,71,71]
["MI3",null,12,2,2]
["MI3",null,12,43,43]
["MI3",null,12,46,46]
["MI3",null,12,84,84]
["MI4",null,12,4,4]
["MI4",null,12,41,41]
["MI4",null,12,43,43]
["MI4",null,12,48,48]
["MI4",null,12,79,79]
["MI5",null,12,78,78]
["NA1",null,12,33,33]
["NA1",null,12,45,45]
["NA1",null,12,66,66]
["NA1",null,12,88,88]
["NA2",null,12,7,7]
["NA2",null,12,14,14]
["NA2",null,12,89,89]
["NA3",null,12,22,22]
["NA3",null,12,61,61]
["NA4",null,12,14,14]
["NA4",null,12,85,85]
["PA1",null,12,30,30]
["PA2",null,12,42,42]
["PA3",null,12,58,58]
["PA3",null,12,84,84]
["PA4",null,12,10,10]
["PA4",null,12,13,13]
["PA4",null,12,17,17]
["PA4",null,12,47,47]
["PA4",null,12,60,60]
["PA4",null,12,67,67]
["PA4",null,12,69,69]
["PA5",null,12,51,51]
["PA5",null,12,53,{"$f":"IF(MOD(B4802+D4802,90),MOD(B4802+D4802,90),90)","v":53}]
["PA5",null,12,70,70]
["PA5",null,12,79,79]
["RO2",null,12,19,19]
["RO2",null,12,42,42]
["RO2",null,12,86,86]
["RO3",null,12,13,13]
["RO3",null,12,32,32]
["RO3",null,12,38,38]
["RO4",null,12,14,14]
["RO4",null,12,29,29]
["RO4",null,12,46,46]
["RO4",null,12,79,79]
["RO5",null,12,47,47]
["RO5",null,12,50,50]
["RO5",null,12,56,56]
["TO1",null,12,3,3]
["TO1",null,12,30,30]
["TO1",null,12,45,45]
["TO2",null,12,79,79]
["TO2",null,12,85,85]
["TO3",null,12,54,54]
["TO4",null,12,31,31]
["TO4",null,12,59,59]
["TO4",null,12,81,81]
["TO5",null,12,32,32]
["VE1",null,12,48,48]
["VE1",null,12,51,51]
["VE1",null,12,76,76]
["VE2",null,12,40,40]
["VE2",null,12,71,71]
["VE3",null,12,65,65]
["VE3",null,12,68,68]
["VE4",null,12,54,54]
["VE4",null,12,90,90]
["VE5",null,12,42,42]
["VE5",null,12,65,65]
["VE5",null,12,81,81]
["NZ1",null,12,4,4]
["NZ1",null,12,48,48]
["NZ1",null,12,54,54]
["NZ1",null,12,86,86]
["NZ3",null,12,58,58]
["NZ3",null,12,83,83]
["NZ4",null,12,86,86]
["NZ5",null,12,8,8]
["BA2",null,13,10,10]
["BA2",null,13,83,83]
["BA4",null,13,80,80]
["BA4",null,13,81,81]
["BA5",null,13,24,24]
["CA2",null,13,37,37]
["CA3",null,13,72,72]
["CA3",null,13,73,73]
["CA3",null,13,76,76]
["CA5",null,13,1,1]
["FI1",null,13,20,20]
["FI1",null,13,22,22]
["FI1",null,13,64,64]
["FI1",null,13,76,76]
["FI2",null,13,50,50]
["FI3",null,13,1,1]
["FI3",null,13,13,13]
["FI4",null,13,44,44]
["FI4",null,13,76,{"$f":"IF(MOD(B4866+D4866,90),MOD(B4866+D4866,90),90)","v":76}]
["FI4",null,13,78,78]
["GE1",null,13,90,90]
["GE2",null,13,81,81]
["GE3",null,13,1,1]
["GE3",null,13,14,14]
["GE5",null,13,47,47]
["MI4",null,13,22,22]
["MI4",null,13,51,51]
["MI5",null,13,22,22]
["MI5",null,13,86,86]
["NA1",null,13,15,15]
["NA2",null,13,52,52]
["NA3",null,13,28,28]
["NA3",null,13,29,29]
["NA4",null,13,36,36]
["NA5",null,13,34,34]
["PA1",null,13,23,23]
["PA1",null,13,85,85]
["PA2",null,13,45,45]
["PA3",null,13,14,14]
["PA5",null,13,36,36]
["PA5",null,13,65,65]
["RO1",null,13,60,60]
["RO2",null,13,24,24]
["RO4",null,13,41,41]
["TO1",null,13,68,68]
["TO2",null,13,53,53]
["TO2",null,13,62,62]
["TO3",null,13,19,19]
["TO4",null,13,53,53]
["TO4",null,13,89,89]
["TO5",null,13,15,15]
["TO5",null,13,68,68]
["VE3",null,13,67,67]
["NZ2",null,13,17,17]
["NZ2",null,13,30,30]
["NZ4",null,13,2,2]
["BA1",null,14,64,64]
["BA2",null,14,50,50]
["BA3",null,14,86,86]
["BA4",null,14,21,21]
["CA1",null,14,65,65]
["CA5",null,14,64,64]
["FI4",null,14,67,67]
["FI5",null,14,79,79]
["GE3",null,14,18,18]
["GE4",null,14,64,64]
["GE4",null,14,86,86]
["GE4",null,14,87,87]
["GE5",null,14,73,73]
["MI1",null,14,73,73]
["MI3",null,14,75,75]
["MI4",null,14,47,47]
["NA1",null,14,60,60]
["NA2",null,14,57,57]
["NA4",null,14,29,29]
["NA4",null,14,83,83]
["PA2",null,14,85,85]
["RO3",null,14,21,21]
["RO5",null,14,29,29]
["TO3",null,14,63,63]
["TO5",null,14,82,82]
["VE1",null,14,46,46]
["VE2",null,14,17,{"$f":"IF(MOD(B4930+D4930,90),MOD(B4930+D4930,90),90)","v":17}]
["VE5",null,14,25,25]
["VE5",null,14,34,34]
["VE5",null,14,72,72]
["NZ4",null,14,3,3]
["NZ5",null,14,46,46]
["BA2",null,15,82,82]
["CA4",null,15,32,32]
["FI2",null,15,5,5]
["FI4",null,15,35,35]
["FI5",null,15,65,65]
["NA2",null,15,13,13]
["NA5",null,15,87,87]
["PA3",null,15,52,52]
["TO2",null,15,26,26]
["NZ2",null,15,2,2]
["NZ1",null,16,75,75]
["NZ2",null,16,32,32]
["NZ3",null,16,24,24]
["FI5",null,17,56,56]
["PA3",null,17,82,82]
["VE2",null,18,22,22]

{"sheet":"agenda","index":4,"n_rows":46,"n_cols":55,"rows_kept":46,"cut":false,"hidden":true,"merged":[]}
[]
[]
[null,null,null,null,null,null,null,null,null,{"$f":"SUM(J5:J13)","v":35},null,null,null,null,null,null,null,null,null,null,{"$f":"SUM(U5:U13)","v":-4}]
[null,null,null,null,null,"N° Record","Ruota","Giocata","N° Di Punt","€ tot Spesi","1Ma Data Estr.",null,"N°1","N°2","N°3","N°4","N°5","N°6","Ultima data Estr.",null,"Entrate","AP/CH",null,null,null,null,"Date Ricariche",null,{"$f":"SUM(AC5:AC11)","v":10}]
[null,null,null,null,1,9992,"Roma","Ambo",2,2,"2021-10-19",{"$f":"K5","v":"2021-10-19"},5,16,29,56,null,null,"2021-10-21",{"$f":"S5","v":"2021-10-21"},-2,"C",null,null,null,null,"2021-10-12",{"$f":"AA5","v":"2021-10-12"},10]
[null,null,null,null,2,9993,"Milano","Ambo",2,2,"2021-10-21",{"$f":"IF(K6=\"\",\"-\",K6)","v":"2021-10-21"},19,66,70,76,null,null,"2021-10-23",{"$f":"IF(S6=\"\",\"-\",S6)","v":"2021-10-23"},-2,"C",null,null,null,null,null,{"$f":"IF(AA6=\"\",\"-\",AA6)","v":"-"},null,null,null,null,null,null,null,null,null,null,null,null,null,null,null,null,null,null,null,null,null,null,null,null,"Bari","A","Ambata"]
[null,null,null,null,3,9994,"Milano","Ambo",3,3,"2021-10-23",{"$f":"IF(K7=\"\",\"-\",K7)","v":"2021-10-23"},20,26,37,79,null,null,"2021-10-28",{"$f":"IF(S7=\"\",\"-\",S7)","v":"2021-10-28"},null,"A",null,null,null,null,null,{"$f":"IF(AA7=\"\",\"-\",AA7)","v":"-"},null,null,null,null,null,null,null,null,null,null,null,null,null,null,null,null,null,null,null,null,null,null,null,null,"Cagliari","C","Ambo"]
[null,null,null,null,4,994,"Torino","Ambata",3,4,"2021-10-23",{"$f":"IF(K8=\"\",\"-\",K8)","v":"2021-10-23"},78,6,null,null,null,null,"2021-10-28",{"$f":"IF(S8=\"\",\"-\",S8)","v":"2021-10-28"},null,"T",null,null,null,null,null,"-",null,null,null,null,null,null,null,null,null,null,null,null,null,null,null,null,null,null,null,null,null,null,null,null,"Firenze","T","Terno"]
[null,null,null,null,5,9994,"Roma","Ambata",3,12,"2021-10-23","2021-10-23",70,73,9,null,null,null,"2021-10-28","2021-10-28",null,"T",null,null,null,null,null,"-",null,null,null,null,null,null,null,null,null,null,null,null,null,null,null,null,null,null,null,null,null,null,null,null,"Genova",null,"Quaterna"]
[null,null,null,null,6,9995,"Bari","Ambata",3,12,"2021-10-26","2021-10-26",61,9,null,null,null,null,"2021-10-30","2021-10-30",null,"T",null,null,null,null,null,"-",null,null,null,null,null,null,null,null,null,null,null,null,null,null,null,null,null,null,null,null,null,null,null,null,"Milano",null,"Cinquina"]
[null,null,null,null,7,null,null,null,null,null,null,"-",null,null,null,null,null,null,null,"-",null,null,null,null,null,null,null,"-",null,null,null,null,null,null,null,null,null,null,null,null,null,null,null,null,null,null,null,null,null,null,null,null,"Napoli"]
[null,null,null,null,8,null,null,null,null,null,null,"-",null,null,null,null,null,null,null,"-",null,null,null,null,null,null,null,null,null,null,null,null,null,null,null,null,null,null,null,null,null,null,null,null,null,null,null,null,null,null,null,null,"Palermo"]
[null,null,null,null,9,null,null,null,null,null,null,"-",null,null,null,null,null,null,null,"-",null,null,null,null,null,null,null,null,null,null,null,null,null,null,null,null,null,null,null,null,null,null,null,null,null,null,null,null,null,null,null,null,"Roma"]
[null,null,null,null,10,null,null,null,null,null,null,"-",null,null,null,null,null,null,null,"-",null,null,null,null,null,null,null,null,null,null,null,null,null,null,null,null,null,null,null,null,null,null,null,null,null,null,null,null,null,null,null,null,"Torino"]
[null,null,null,null,11,null,null,null,null,null,null,"-",null,null,null,null,null,null,null,"-",null,null,null,null,null,null,null,null,null,null,null,null,null,null,null,null,null,null,null,null,null,null,null,null,null,null,null,null,null,null,null,null,"Venezia"]
[null,null,null,null,12,null,null,null,null,null,null,"-",null,null,null,null,null,null,null,"-",null,null,null,null,null,null,null,null,null,null,null,null,null,null,null,null,null,null,null,null,null,null,null,null,null,null,null,null,null,null,null,null,"Nazionale"]
[null,null,null,null,13,null,null,null,null,null,null,"-",null,null,null,null,null,null,null,"-"]
[null,null,null,null,14,null,null,null,null,null,null,{"$f":"IF(K18=\"\",\"-\",K18)","v":"-"},null,null,null,null,null,null,null,{"$f":"IF(S18=\"\",\"-\",S18)","v":"-"}]
[null,null,null,null,15,null,null,null,null,null,null,"-",null,null,null,null,null,null,null,"-"]
[null,null,null,null,16,null,null,null,null,null,null,"-",null,null,null,null,null,null,null,"-"]
[null,null,null,null,17,null,null,null,null,null,null,"-",null,null,null,null,null,null,null,"-"]
[null,null,null,null,18,null,null,null,null,null,null,"-",null,null,null,null,null,null,null,"-"]
[null,null,null,null,19,null,null,null,null,null,null,"-",null,null,null,null,null,null,null,"-"]
[null,null,null,null,20,null,null,null,null,null,null,"-",null,null,null,null,null,null,null,"-"]
[null,null,null,null,21,null,null,null,null,null,null,"-",null,null,null,null,null,null,null,"-"]
[null,null,null,null,22,null,null,null,null,null,null,"-",null,null,null,null,null,null,null,"-"]
[null,null,null,null,23,null,null,null,null,null,null,"-",null,null,null,null,null,null,null,"-"]
[null,null,null,null,24,null,null,null,null,null,null,"-",null,null,null,null,null,null,null,"-"]
[null,null,null,null,25,null,null,null,null,null,null,"-",null,null,null,null,null,null,null,"-"]
[null,null,null,null,26,null,null,null,null,null,null,"-",null,null,null,null,null,null,null,"-"]
[null,null,null,null,27,null,null,null,null,null,null,"-",null,null,null,null,null,null,null,"-"]
[null,null,null,null,28,null,null,null,null,null,null,"-",null,null,null,null,null,null,null,"-"]
[null,null,null,null,29,null,null,null,null,null,null,"-",null,null,null,null,null,null,null,"-"]
[null,null,null,null,30,null,null,null,null,null,null,"-",null,null,null,null,null,null,null,"-"]
[null,null,null,null,31,null,null,null,null,null,null,"-",null,null,null,null,null,null,null,"-"]
[null,null,null,null,32,null,null,null,null,null,null,"-",null,null,null,null,null,null,null,"-"]
[null,null,null,null,33,null,null,null,null,null,null,"-",null,null,null,null,null,null,null,"-"]
[null,null,null,null,34,null,null,null,null,null,null,"-",null,null,null,null,null,null,null,"-"]
[null,null,null,null,35,null,null,null,null,null,null,"-",null,null,null,null,null,null,null,"-"]
[null,null,null,null,36,null,null,null,null,null,null,"-",null,null,null,null,null,null,null,"-"]
[null,null,null,null,37,null,null,null,null,null,null,"-",null,null,null,null,null,null,null,"-"]
[null,null,null,null,38,null,null,null,null,null,null,"-",null,null,null,null,null,null,null,"-"]
[null,null,null,null,39,null,null,null,null,null,null,"-",null,null,null,null,null,null,null,"-"]
[null,null,null,null,40,null,null,null,null,null,null,"-",null,null,null,null,null,null,null,"-"]
[null,null,null,null,41,null,null,null,null,null,null,"-",null,null,null,null,null,null,null,"-"]
[null,null,null,null,42,null,null,null,null,null,null,"-",null,null,null,null,null,null,null,"-"]

{"sheet":"Servizio","index":5,"n_rows":46,"n_cols":40,"rows_kept":46,"cut":false,"hidden":true,"merged":[]}
[]
[]
[]
[null,null,null,null,null,null,null,{"$f":"#REF!","v":{"$error":"#REF!"}},null,"Ruota e posiz","Num ADD"]
[null,null,"Meno 40",{"$f":"D7-40+1","v":9954},{"$f":"IFERROR(VLOOKUP(D5,Archivio!A3:C4998,3),\"manca\")","v":"2021-07-22"},null,1,"Bari",null,"VE2",71,null,null,"AMBATA SU 3 NUMERI x 4 Volte"]
[null,null,"Meno 128",{"$f":"D7-128+1","v":9866},{"$f":"IFERROR(VLOOKUP(D6,Archivio!A3:C4999,3),\"manca\")","v":"2020-12-29"},null,2,"Cagliari",null,"PA5",12,null,1,"TOT N°","x 1 N°","Spesa","tot sp","x 11","Netto -6%","in %",null,null,null,null,null,null,null,null,null,null,null,null,null,null,null,null,"PROMEMORIA"]
[null,null,"Record N°",9993,{"$f":"IFERROR(VLOOKUP(D7,Archivio!A3:C5000,3),\"manca\")","v":"2021-10-21"},null,3,"Firenze",null,"MI5",88,null,1,3,1,{"$f":"N7*O7","v":3},{"$f":"P7","v":3},{"$f":"O7*11.22","v":11.22},{"$f":"R7-(R7*6%)-P7","v":7.5468000000000011},{"$f":"S7/Q7","v":2.5156000000000005},null,"1mo estr","MI","Data Punt.","GG","i 3 numeri",null,null,"punto","Punto x3","Esito","Netto",null,null,null,null,"N° Record A2","Ruota","Addendi","Ritard."]
[null,null,"Piu 128",{"$f":"D7+128-1","v":10120},{"$f":"IFERROR(VLOOKUP(D8,Archivio!A3:C5001,3),\"manca\")","v":"2021-10-23"},null,4,"Genova",null,"VE5",72,null,2,3,1.5,{"$f":"N8*O8","v":4.5},{"$f":"P8+Q7","v":7.5},{"$f":"O8*11.22","v":16.830000000000002},{"$f":"(R8-(R8*6%)-Q8)","v":8.3202000000000016},{"$f":"S8/Q8","v":1.1093600000000001},null,null,1,"2021-10-23",{"$f":"IF(X8=\"\",\"-\",X8)","v":"2021-10-23"},5,23,15,2,{"$f":"AC8*3","v":6},"p",null,null,null,null,null,9866,"Bari",4,2]
[null,null,"Piu 40",{"$f":"D7+40-1","v":10032},{"$f":"IFERROR(VLOOKUP(D9,Archivio!A3:C5002,3),\"manca\")","v":"2021-10-23"},null,5,"Milano",null,null,null,null,3,3,2,{"$f":"N9*O9","v":6},{"$f":"P9+Q8","v":13.5},22.44,{"$f":"(R9-(R9*6%)-Q9)","v":7.5936000000000021},0.56248888888888904,null,null,2,"2021-10-26",{"$f":"IF(X9=\"\",\"-\",X9)","v":"2021-10-26"},5,23,15,2.5,{"$f":"AC9*3","v":7.5}]
[null,null,"Rec. in A2",9848,{"$f":"IFERROR(VLOOKUP(D10,Archivio!A5:C5003,3),\"manca\")","v":"2020-11-17"},null,6,"Napoli",null,null,null,null,4,3,3,{"$f":"N10*O10","v":9},22.5,33.660000000000004,{"$f":"(R10-(R10*6%)-Q10)","v":9.1404000000000032},0.40624000000000016,null,9994,3,"2021-10-28","2021-10-28",5,23,15,null,0]
[null,null,"Rec.finale",{"$f":"D10+(128)-1","v":9975},{"$f":"IFERROR(VLOOKUP(D11,Archivio!A6:C5004,3),\"manca\")","v":"2021-09-09"},null,7,"Palermo",null,null,null,null,null,null,null,null,null,null,null,null,null,"Progr N° 3",4,"2021-10-30","2021-10-30",5,23,15,null,0]
[null,null,"Rec.in Script",{"$f":"D10-1+88","v":9935},{"$f":"IFERROR(VLOOKUP(D12,Archivio!A7:C5005,3),\"manca\")","v":"2021-06-08"},null,8,"Roma"]
[null,null,"Rec. Script",9935,{"$f":"IFERROR(VLOOKUP(D13,Archivio!A8:C5006,3),\"manca\")","v":"2021-06-08"},null,9,"Torino",null,null,null,null,2,"TOT N°","x 1 N°","Spesa","tot sp","x 11","Netto -6%","in %"]
[null,null,"Rec.finale",{"$f":"D15+128-1","v":9975},{"$f":"IFERROR(VLOOKUP(D14,Archivio!A9:C5007,3),\"manca\")","v":"2021-09-09"},null,10,"Venezia",null,null,null,null,1,3,1.5,{"$f":"N14*O14","v":4.5},{"$f":"N14*11.22","v":33.660000000000004},{"$f":"O14*11","v":16.5},{"$f":"R14-(R14*6%)-P14","v":11.01},{"$f":"S14/Q14","v":0.32709447415329762},null,"1mo estr","MI","Data Punt.","GG","i 3 numeri",null,null,"punto","Punto x3","Esito","Netto"]
[null,null,"Rec. In A2",{"$f":"D13-88+1","v":9848},{"$f":"IFERROR(VLOOKUP(D15,Archivio!A10:C5008,3),\"manca\")","v":"2020-11-17"},null,11,"Nazionale",null,null,null,null,2,3,2,{"$f":"N15*O15","v":6},{"$f":"N15*11.22","v":33.660000000000004},{"$f":"O15*11","v":22},{"$f":"(R15-(R15*6%)-Q15)","v":-12.980000000000004},{"$f":"S15/Q15","v":-0.38562091503267981},null,null,1,null,{"$f":"IF(X15=\"\",\"-\",X15)","v":"-"},null,null,null,2,{"$f":"AC15*3","v":6}]
[null,null,9992,null,null,null,null,null,null,null,null,null,3,3,2.5,{"$f":"N16*O16","v":7.5},33.660000000000004,{"$f":"O16*11","v":27.5},{"$f":"(R16-(R16*6%)-Q16)","v":-7.8100000000000023},-0.23202614379084971,null,null,2,null,{"$f":"IF(X16=\"\",\"-\",X16)","v":"-"},null,null,null,2.5,{"$f":"AC16*3","v":7.5}]
[null,null,"Rec. in FGL Cicli 32 (A2)",null,{"$f":"#REF!","v":{"$error":"#REF!"}},null,"1na Punt",2,null,null,null,null,4,3,4,{"$f":"N17*O17","v":12},33.660000000000004,44,{"$f":"(R17-(R17*6%)-Q17)","v":7.6999999999999957},0.22875816993464038,null,99990,3,null,"-",null,null,null,3,9]
[null,null,"N° di Iniz. analisi fgl cicli32",null,{"$f":"E17-1","v":{"$error":"#REF!"}},null,"Max Esposiz.",88,null,null,null,null,null,null,null,null,null,null,null,null,null,"Progr N° 3",4,null,"-",null,null,null,null,0]
[null,null,"Record NON Analizz 22X4",null,88,null,"N°Puntate",{"$f":"H18/(4*H17)","v":11}]
[null,null,"N° da inserire nello Script",null,{"$f":"E18+E19","v":{"$error":"#REF!"}},{"$f":"E23-E21","v":{"$error":"#VALUE!"}},null,null,null,null,null,null,3,"TOT N°","x 1 N°","Spesa","tot sp","x 11","Netto -6%","in %"]
[null,null,null,"DA",{"$f":"IFERROR(VLOOKUP(E20,Archivio!A3:C5008,3),\"manca\")","v":"manca"},null,null,null,null,null,null,null,1,3,2,{"$f":"N21*O21","v":6},{"$f":"P21","v":6},{"$f":"O21*11.22","v":22.44},{"$f":"R21-(R21*6%)-P21","v":15.093600000000002},{"$f":"S21/Q21","v":2.5156000000000005},null,"1mo estr","MI","Data Punt.","GG","i 3 numeri",null,null,"punto","Punto x3","Esito","Netto"]
[null,null,"Ultimo Record in Fgl 32",null,{"$f":"#REF!","v":{"$error":"#REF!"}},null,null,null,null,null,null,null,2,3,2.5,{"$f":"N22*O22","v":7.5},{"$f":"P22+Q21","v":13.5},{"$f":"O22*11.22","v":28.05},{"$f":"(R22-(R22*6%)-Q22)","v":12.867000000000001},{"$f":"S22/Q22","v":0.95311111111111113},null,null,1,null,{"$f":"IF(X22=\"\",\"-\",X22)","v":"-"},null,null,null,2,{"$f":"AC22*3","v":6}]
[null,null,null,"A",{"$f":"IFERROR(VLOOKUP(E22,Archivio!A3:C5010,3),\"manca\")","v":"manca"},null,null,null,null,null,null,null,3,3,3,{"$f":"N23*O23","v":9},{"$f":"P23+Q22","v":22.5},33.660000000000004,{"$f":"(R23-(R23*6%)-Q23)","v":9.1404000000000032},0.40624000000000016,null,"2021-10-12",2,null,{"$f":"IF(X23=\"\",\"-\",X23)","v":"-"},null,null,null,2.5,{"$f":"AC23*3","v":7.5}]
[null,null,{"$f":"INT($F$20/360)&\" Anni  \"&INT(MOD($F$20,360)/30)&\" Mesi  \"& $F$20-(INT($F$20/360)*360)-INT(MOD($F$20,360)/30)*30 & \" Giorni\"","v":{"$error":"#VALUE!"}},null,null,null,null,null,null,null,null,null,4,3,4,{"$f":"N24*O24","v":12},34.5,44.88,{"$f":"(R24-(R24*6%)-Q24)","v":7.6872000000000043},0.22281739130434794,null,9989,3,null,"-",null,null,null,3,9]
[null,null,"Lo SCRIPT Analizza Ultime  Estraz",null,{"$f":"E22-E20","v":{"$error":"#REF!"}},null,null,null,null,null,null,null,null,null,null,null,null,null,null,null,null,"Progr N° 3",4,null,"-",null,null,null,4,12]
[]
[null,null,null,null,null,null,null,null,null,null,null,null,null,"AMBATA SU 4 NUMERI x 4 Volte"]
[null,null,null,null,null,null,null,null,null,null,null,null,4,"TOT N°","x 1 N°","Spesa","tot sp","x 11","Netto -6%","in %"]
[null,null,null,null,null,null,null,null,null,null,null,null,1,4,1,{"$f":"N29*O29","v":4},{"$f":"P29","v":4},{"$f":"O29*11.22","v":11.22},{"$f":"R29-(R29*6%)-P29","v":6.5468000000000011},{"$f":"S29/Q29","v":1.6367000000000003}]
[null,null,null,null,null,null,null,null,null,null,null,null,2,4,2,{"$f":"N30*O30","v":8},{"$f":"P30+Q29","v":12},{"$f":"O30*11.22","v":22.44},{"$f":"(R30-(R30*6%)-Q30)","v":9.0936000000000021},{"$f":"S30/Q30","v":0.75780000000000014}]
[null,null,null,null,null,null,null,null,null,null,null,null,3,4,3.5,{"$f":"N31*O31","v":14},{"$f":"P31+Q30","v":26},39.270000000000003,{"$f":"(R31-(R31*6%)-Q31)","v":10.913800000000002},0.41976153846153852]
[null,null,null,null,null,null,null,null,null,null,null,null,4,4,5.5,{"$f":"N32*O32","v":22},48,61.71,{"$f":"(R32-(R32*6%)-Q32)","v":10.007400000000004},0.20848750000000008]
[]
[]
[null,null,null,null,null,null,null,null,null,null,null,null,5,"TOT N°","x 1 N°","Spesa","tot sp","x 11","Netto -6%","in %"]
[null,null,null,null,null,null,null,null,null,null,null,null,1,4,2,{"$f":"N36*O36","v":8},{"$f":"P36","v":8},{"$f":"O36*11.22","v":22.44},{"$f":"R36-(R36*6%)-P36","v":13.093600000000002},{"$f":"S36/Q36","v":1.6367000000000003}]
[null,null,null,null,null,null,null,null,null,null,null,null,2,4,2.5,{"$f":"N37*O37","v":10},{"$f":"P37+Q36","v":18},{"$f":"O37*11.22","v":28.05},{"$f":"(R37-(R37*6%)-Q37)","v":8.3670000000000009},{"$f":"S37/Q37","v":0.46483333333333338}]
[null,null,null,null,null,null,null,null,null,null,null,null,3,4,4,{"$f":"N38*O38","v":16},{"$f":"P38+Q37","v":34},44.88,{"$f":"(R38-(R38*6%)-Q38)","v":8.1872000000000043},0.24080000000000013]
[null,null,null,null,null,null,null,null,null,null,null,null,4,4,6,{"$f":"N39*O39","v":24},58,67.320000000000007,{"$f":"(R39-(R39*6%)-Q39)","v":5.2808000000000064},9.1048275862069081E-2]
[]
[]
[null,null,null,null,null,null,null,null,null,null,null,null,6,"TOT N°","x 1 N°","Spesa","tot sp","x 11","Netto -6%","in %"]
[null,null,null,null,null,null,null,null,null,null,null,null,1,4,2.5,{"$f":"N43*O43","v":10},{"$f":"P43","v":10},{"$f":"O43*11.22","v":28.05},{"$f":"R43-(R43*6%)-P43","v":16.367000000000001},{"$f":"S43/Q43","v":1.6367}]
[null,null,null,null,null,null,null,null,null,null,null,null,2,4,3,{"$f":"N44*O44","v":12},{"$f":"P44+Q43","v":22},{"$f":"O44*11.22","v":33.660000000000004},{"$f":"(R44-(R44*6%)-Q44)","v":9.6404000000000032},{"$f":"S44/Q44","v":0.43820000000000014}]
[null,null,null,null,null,null,null,null,null,null,null,null,3,4,4.5,{"$f":"N45*O45","v":18},{"$f":"P45+Q44","v":40},50.49,{"$f":"(R45-(R45*6%)-Q45)","v":7.4605999999999995},0.18651499999999999]
[null,null,null,null,null,null,null,null,null,null,null,null,4,4,7,{"$f":"N46*O46","v":28},68,78.540000000000006,{"$f":"(R46-(R46*6%)-Q46)","v":5.8276000000000039},8.5700000000000054E-2]